{"text_format":"3","workbook":"xlsx","n_sheets":9,"sheets":["EXPLANATION","Period booking","Total prices","Transmission tariffs","Neutrality charge","bladen rechts alleen voor inter","Optimisation","Multipliers and SF","Validation"],"not_rendered":{"images":9,"macros":1,"external_links":1,"defined_names":9},"read":"whole","date_system":"1900"}

{"sheet":"EXPLANATION","index":0,"n_rows":66,"n_cols":9,"rows_kept":66,"merged":[[16,1,16,2],[17,1,17,2],[18,1,18,2],[19,1,19,2],[20,1,20,2],[25,1,27,10],[29,1,32,10],[34,2,36,10],[38,2,40,10],[42,2,44,10],[48,2,48,10],[50,2,51,10],[53,2,54,10],[56,2,58,10],[61,1,62,10],[65,1,67,10]]}
[]
[]
[]
[null,"DISCLAIMER"]
[]
[null,"- GTS only provide's this file as service, no rights whatsoever may be derived from these calculations, shipper' bookings and GTS Invoices are leading."]
[null,"- Tariffs used in the calculation are the total prices for 2027"]
[null,"- Total price is the sum of the all-in transmission tariff and the neutrality charge, whereby:"]
[null,"- transmission tariffs for 2027 are established by the Dutch regulator ACM (26 May 2026)"]
[null,"- neutrality charges for 2027 are established by GTS in accordance with the calculation methodology as stated in de Transmission Code Gas TSO"]
[null,null,"Tariff decision 2027 › Gasunie Transport Services"]
[null,"- Multipliers and seasonal factors used as established by the Duth regulator ACM in the NC TAR decision (25 April 2024):"]
[null,null,"https://www.acm.nl/nl/publicaties/codebesluit-ter-uitvoering-van-nc-tar",{"$nulls":5},"(Dutch)"]
[]
[null,"LEGEND"]
[]
[null,"GREEN",null,null,"Input cells to be filled out by user"]
[null,"BLUE",null,null,"Fixed input data"]
[null,"YELLOW",null,null,"Calculated value "]
[null,"ORANGE",null,null,"Calculated resulting value"]
{"$rows_left_out":47}
{"sheet":"Period booking","index":1,"n_rows":42,"n_cols":8,"rows_kept":42,"merged":[[3,1,4,10],[12,1,12,7],[17,13,17,14]]}
[]
[]
[]
[null,"CALCULATION TOOL FOR OPTIMISATION OF PERIOD BOOKINGS INTO (Y, Q, M, DA) FIRM CAPACITY PRODUCTS"]
[]
[null,"Please fill in the appropriate values in the GREEN fields and find the optimalisation results below"]
[]
[null,"Start date",{"$f":"IF(OR(ISERROR(DAY($D$8)),ISERROR(DAY($D$9))),1,IF(OR($D$9<$D$8,$D$9>$D$8+366,$D$11<0),1,0))","v":0},"2027-03-01",{"$f":"IF(OR(ISERROR(DAY($D$8)),ISERROR(DAY($D$9))),\"WARNING: calculation not reliable due to incorrect start or end date; please correct!\",IF(D9<D8,\"WARNING: calculation not reliable due to incorrect start and end date (start date NOT before end date); please correct!\",IF(D9>D8+366,\" WARNING: calculation not reliable due to incorrect start and end date (period > 1 year), please correct!\",\"\")))","v":""}]
[null,"End date (including)",null,"2027-07-01",{"$f":"IF(Optimisation!$T$53=11,\"REMARK: for this period a yearly booking is cheaper; please add 12th month to period for monthly cost estimate!\",IF(Optimisation!$T$53=10,\"REMARK: for this period a yearly booking is cheaper; please add 11th and 12th month to period for monthly cost estimate!\",IF(Optimisation!$T$53=9,\"REMARK: for this period a yearly booking is cheaper; please add 10th, 11th and 12th month to period for monthly cost estimate!\",\"\")))","v":""}]
[null,"Postage stamp point",null,"Exit non-storage","For all dates/periods, the prices used in the calculation tool are the total prices 2027 (see sheet 'Explanation')"]
[null,"Quantity ","kWh/h",{"v":500000,"d":"500,000"},{"$f":"IF(D11<0,\"WARNING: quantity is negative, please correct to positive value!\",\"\")","v":""}]
[]
[null,"PERIOD BOOKING CONVERTED INTO OPTIMISED COMBINATION OF Y, Q, M, DA CAPACITY PRODUCTS"]
[]
[null,"Month","Year","Yearly capacity booking","Quarterly capacity booking","Monthly capacity booking","Daily capacity \nbooking","Cost/month\nbased on 2027 tariffs"]
[{"$nulls":3},"kWh/h","kWh/h","kWh/h","kWh/h","EUR"]
[]
[{"$nulls":6},"Total cost:",{"$f":"SUM(H19:H42)","v":{"v":1019090.43,"d":"€ 1,019,090"}}]
[null,"January",{"$f":"IF($C$8=1,\"\",YEAR(D$8))","v":2027},{"$f":"IF($C$8=1,\"\",Optimisation!Y29)","v":""},{"$f":"IF($C$8=1,\"\",Optimisation!Z29)","v":""},{"$f":"IF($C$8=1,\"\",Optimisation!AA29)","v":""},{"$f":"IF($C$8=1,\"\",Optimisation!AB29)","v":""},{"$f":"IF($C$8=1,\"\",Optimisation!X29)","v":{"v":0,"d":"€ 0"}}]
[null,"February",{"$f":"IF($C$8=1,\"\",YEAR(D$8))","v":2027},{"$f":"IF($C$8=1,\"\",Optimisation!Y30)","v":""},{"$f":"IF($C$8=1,\"\",Optimisation!Z30)","v":""},{"$f":"IF($C$8=1,\"\",Optimisation!AA30)","v":""},{"$f":"IF($C$8=1,\"\",Optimisation!AB30)","v":""},{"$f":"IF($C$8=1,\"\",Optimisation!X30)","v":{"v":0,"d":"€ 0"}}]
{"$rows_left_out":23}
{"sheet":"Total prices","index":2,"n_rows":42,"n_cols":19,"rows_kept":42,"merged":[[7,2,7,6],[7,8,7,12],[7,14,7,18],[12,2,23,2],[12,3,14,3],[12,8,23,8],[12,9,14,9],[12,14,23,14],[12,15,14,15],[15,3,17,3],[15,9,17,9],[15,15,17,15],[18,3,20,3],[18,9,20,9],[18,15,20,15],[21,3,23,3],[21,9,23,9],[21,15,23,15],[25,2,25,6],[25,8,25,12],[30,2,41,2],[30,3,32,3],[30,8,41,8],[30,9,32,9],[33,3,35,3],[33,9,35,9],[36,3,38,3],[36,9,38,9],[39,3,41,3],[39,9,41,9]]}
[]
[]
[]
[null,"TOTAL PRICES 2027 FIRM CAPACITY (which is sum of the all-in transmission tariffs and the neutrality charges)"]
[]
[]
[]
[null,"Total prices FIRM capacity for interconnection points","ENTRY REGULAR",{"$nulls":5},"ENTRY STORAGE",{"$nulls":5},"ENTRY LNG"]
[null,"Payable total prices FIRM capacity for domestic points"]
[null,null,"Year","Quarter","Month","Day","Within-day",null,"Year","Quarter","Month","Day","Within-day",null,"Year","Quarter","Month","Day","Within-day"]
[null,null,"EUR/kWh/h/Y","EUR/kWh/h/Q","EUR/kWh/h/M","EUR/kWh/h/DA","EUR/kWh/h/WID",null,"EUR/kWh/h/Y","EUR/kWh/h/Q","EUR/kWh/h/M","EUR/kWh/h/DA","EUR/kWh/h/WID",null,"EUR/kWh/h/Y","EUR/kWh/h/Q","EUR/kWh/h/M","EUR/kWh/h/DA","EUR/kWh/h/WID"]
[]
[null,"January",{"$f":"'Transmission tariffs'!C13+'Neutrality charge'!C13","v":{"v":5.4725366399999995,"d":"5.47253664"}},{"$f":"'Transmission tariffs'!D13+'Neutrality charge'!D13","v":{"v":2.4997497799999997,"d":"2.49974978"}},{"$f":"'Transmission tariffs'!E13+'Neutrality charge'!E13","v":1.19567429},{"$f":"'Transmission tariffs'!F13+'Neutrality charge'!F13","v":0.04652031},{"$f":"'Transmission tariffs'!G13+'Neutrality charge'!G13","v":0.00193835},null,{"$f":"'Transmission tariffs'!I13+'Neutrality charge'!I13","v":{"v":1.3681341699999998,"d":"1.36813417"}},{"$f":"'Transmission tariffs'!J13+'Neutrality charge'!J13","v":{"v":0.6249374499999999,"d":"0.62493745"}},{"$f":"'Transmission tariffs'!K13+'Neutrality charge'!K13","v":0.29891858},{"$f":"'Transmission tariffs'!L13+'Neutrality charge'!L13","v":{"v":0.011630080000000001,"d":"0.01163008"}},{"$f":"'Transmission tariffs'!M13+'Neutrality charge'!M13","v":0.00048459},null,{"$f":"'Transmission tariffs'!O13+'Neutrality charge'!O13","v":{"v":5.4725366399999995,"d":"5.47253664"}},{"$f":"'Transmission tariffs'!P13+'Neutrality charge'!P13","v":{"v":2.4997497799999997,"d":"2.49974978"}},{"$f":"'Transmission tariffs'!Q13+'Neutrality charge'!Q13","v":1.19567429},{"$f":"'Transmission tariffs'!R13+'Neutrality charge'!R13","v":0.04652031},{"$f":"'Transmission tariffs'!S13+'Neutrality charge'!S13","v":0.00193835}]
[null,"February",null,null,{"$f":"'Transmission tariffs'!E14+'Neutrality charge'!E14","v":0.96535546},{"$f":"'Transmission tariffs'!F14+'Neutrality charge'!F14","v":0.04158753},{"$f":"'Transmission tariffs'!G14+'Neutrality charge'!G14","v":{"v":1.73281E-3,"d":"0.00173281"}},{"$nulls":3},{"$f":"'Transmission tariffs'!K14+'Neutrality charge'!K14","v":0.24133887},{"$f":"'Transmission tariffs'!L14+'Neutrality charge'!L14","v":{"v":0.010396879999999999,"d":"0.01039688"}},{"$f":"'Transmission tariffs'!M14+'Neutrality charge'!M14","v":{"v":0.0004332,"d":"0.00043320"}},{"$nulls":3},{"$f":"'Transmission tariffs'!Q14+'Neutrality charge'!Q14","v":0.96535546},{"$f":"'Transmission tariffs'!R14+'Neutrality charge'!R14","v":0.04158753},{"$f":"'Transmission tariffs'!S14+'Neutrality charge'!S14","v":{"v":1.73281E-3,"d":"0.00173281"}}]
[null,"March",null,null,{"$f":"'Transmission tariffs'!E15+'Neutrality charge'!E15","v":0.83592623},{"$f":"'Transmission tariffs'!F15+'Neutrality charge'!F15","v":0.03250911},{"$f":"'Transmission tariffs'!G15+'Neutrality charge'!G15","v":{"v":1.35454E-3,"d":"0.00135454"}},{"$nulls":3},{"$f":"'Transmission tariffs'!K15+'Neutrality charge'!K15","v":{"v":0.20898155000000002,"d":"0.20898155"}},{"$f":"'Transmission tariffs'!L15+'Neutrality charge'!L15","v":{"v":0.008127279999999999,"d":"0.00812728"}},{"$f":"'Transmission tariffs'!M15+'Neutrality charge'!M15","v":0.00033863},{"$nulls":3},{"$f":"'Transmission tariffs'!Q15+'Neutrality charge'!Q15","v":0.83592623},{"$f":"'Transmission tariffs'!R15+'Neutrality charge'!R15","v":0.03250911},{"$f":"'Transmission tariffs'!S15+'Neutrality charge'!S15","v":{"v":1.35454E-3,"d":"0.00135454"}}]
[null,"April",null,{"$f":"'Transmission tariffs'!D16+'Neutrality charge'!D16","v":1.33709813},{"$f":"'Transmission tariffs'!E16+'Neutrality charge'!E16","v":{"v":0.6031785,"d":"0.60317850"}},{"$f":"'Transmission tariffs'!F16+'Neutrality charge'!F16","v":{"v":0.024244079999999998,"d":"0.02424408"}},{"$f":"'Transmission tariffs'!G16+'Neutrality charge'!G16","v":0.00101017},null,null,{"$f":"'Transmission tariffs'!J16+'Neutrality charge'!J16","v":0.33427453},{"$f":"'Transmission tariffs'!K16+'Neutrality charge'!K16","v":0.15079462},{"$f":"'Transmission tariffs'!L16+'Neutrality charge'!L16","v":{"v":0.006061029999999999,"d":"0.00606103"}},{"$f":"'Transmission tariffs'!M16+'Neutrality charge'!M16","v":0.00025255},null,null,{"$f":"'Transmission tariffs'!P16+'Neutrality charge'!P16","v":1.33709813},{"$f":"'Transmission tariffs'!Q16+'Neutrality charge'!Q16","v":{"v":0.6031785,"d":"0.60317850"}},{"$f":"'Transmission tariffs'!R16+'Neutrality charge'!R16","v":{"v":0.024244079999999998,"d":"0.02424408"}},{"$f":"'Transmission tariffs'!S16+'Neutrality charge'!S16","v":0.00101017}]
[null,"May",null,null,{"$f":"'Transmission tariffs'!E17+'Neutrality charge'!E17","v":0.55217145},{"$f":"'Transmission tariffs'!F17+'Neutrality charge'!F17","v":{"v":0.021489079999999997,"d":"0.02148908"}},{"$f":"'Transmission tariffs'!G17+'Neutrality charge'!G17","v":0.00089538},{"$nulls":3},{"$f":"'Transmission tariffs'!K17+'Neutrality charge'!K17","v":{"v":0.13804286999999998,"d":"0.13804287"}},{"$f":"'Transmission tariffs'!L17+'Neutrality charge'!L17","v":{"v":0.005372259999999999,"d":"0.00537226"}},{"$f":"'Transmission tariffs'!M17+'Neutrality charge'!M17","v":{"v":2.2384E-4,"d":"0.00022384"}},{"$nulls":3},{"$f":"'Transmission tariffs'!Q17+'Neutrality charge'!Q17","v":0.55217145},{"$f":"'Transmission tariffs'!R17+'Neutrality charge'!R17","v":{"v":0.021489079999999997,"d":"0.02148908"}},{"$f":"'Transmission tariffs'!S17+'Neutrality charge'!S17","v":0.00089538}]
[null,"June",null,null,{"$f":"'Transmission tariffs'!E18+'Neutrality charge'!E18","v":{"v":0.44867303999999997,"d":"0.44867304"}},{"$f":"'Transmission tariffs'!F18+'Neutrality charge'!F18","v":0.01805187},{"$f":"'Transmission tariffs'!G18+'Neutrality charge'!G18","v":0.00075216},{"$nulls":3},{"$f":"'Transmission tariffs'!K18+'Neutrality charge'!K18","v":{"v":0.11216825999999999,"d":"0.11216826"}},{"$f":"'Transmission tariffs'!L18+'Neutrality charge'!L18","v":0.00451296},{"$f":"'Transmission tariffs'!M18+'Neutrality charge'!M18","v":{"v":1.8804E-4,"d":"0.00018804"}},{"$nulls":3},{"$f":"'Transmission tariffs'!Q18+'Neutrality charge'!Q18","v":{"v":0.44867303999999997,"d":"0.44867304"}},{"$f":"'Transmission tariffs'!R18+'Neutrality charge'!R18","v":0.01805187},{"$f":"'Transmission tariffs'!S18+'Neutrality charge'!S18","v":0.00075216}]
[null,"July",null,{"$f":"'Transmission tariffs'!D19+'Neutrality charge'!D19","v":{"v":1.0845368100000001,"d":"1.08453681"}},{"$f":"'Transmission tariffs'!E19+'Neutrality charge'!E19","v":{"v":0.43783290999999996,"d":"0.43783291"}},{"$f":"'Transmission tariffs'!F19+'Neutrality charge'!F19","v":0.01702858},{"$f":"'Transmission tariffs'!G19+'Neutrality charge'!G19","v":0.00070952},null,null,{"$f":"'Transmission tariffs'!J19+'Neutrality charge'!J19","v":{"v":0.2711342,"d":"0.27113420"}},{"$f":"'Transmission tariffs'!K19+'Neutrality charge'!K19","v":0.10945823},{"$f":"'Transmission tariffs'!L19+'Neutrality charge'!L19","v":{"v":4.2571499999999995E-3,"d":"0.00425715"}},{"$f":"'Transmission tariffs'!M19+'Neutrality charge'!M19","v":0.00017738},null,null,{"$f":"'Transmission tariffs'!P19+'Neutrality charge'!P19","v":{"v":1.0845368100000001,"d":"1.08453681"}},{"$f":"'Transmission tariffs'!Q19+'Neutrality charge'!Q19","v":{"v":0.43783290999999996,"d":"0.43783291"}},{"$f":"'Transmission tariffs'!R19+'Neutrality charge'!R19","v":0.01702858},{"$f":"'Transmission tariffs'!S19+'Neutrality charge'!S19","v":0.00070952}]
[null,"August",null,null,{"$f":"'Transmission tariffs'!E20+'Neutrality charge'!E20","v":0.41622015},{"$f":"'Transmission tariffs'!F20+'Neutrality charge'!F20","v":{"v":0.0162152,"d":"0.01621520"}},{"$f":"'Transmission tariffs'!G20+'Neutrality charge'!G20","v":0.00067564},{"$nulls":3},{"$f":"'Transmission tariffs'!K20+'Neutrality charge'!K20","v":0.10405504},{"$f":"'Transmission tariffs'!L20+'Neutrality charge'!L20","v":{"v":0.0040538,"d":"0.00405380"}},{"$f":"'Transmission tariffs'!M20+'Neutrality charge'!M20","v":0.00016891},{"$nulls":3},{"$f":"'Transmission tariffs'!Q20+'Neutrality charge'!Q20","v":0.41622015},{"$f":"'Transmission tariffs'!R20+'Neutrality charge'!R20","v":{"v":0.0162152,"d":"0.01621520"}},{"$f":"'Transmission tariffs'!S20+'Neutrality charge'!S20","v":0.00067564}]
{"$rows_left_out":23}
{"sheet":"Transmission tariffs","index":3,"n_rows":42,"n_cols":19,"rows_kept":42,"merged":[[7,2,7,6],[7,8,7,12],[7,14,7,18],[12,2,23,2],[12,3,14,3],[12,8,23,8],[12,9,14,9],[12,14,23,14],[12,15,14,15],[15,3,17,3],[15,9,17,9],[15,15,17,15],[18,3,20,3],[18,9,20,9],[18,15,20,15],[21,3,23,3],[21,9,23,9],[21,15,23,15],[25,2,25,6],[25,8,25,12],[30,2,41,2],[30,3,32,3],[30,8,41,8],[30,9,32,9],[33,3,35,3],[33,9,35,9],[36,3,38,3],[36,9,38,9],[39,3,41,3],[39,9,41,9]]}
[]
[]
[]
[null,"ALL-IN TRANSMISSION TARIFFS 2027 (as established by the Dutch regulator ACM)"]
[]
[null,"Tariffs are all rounded to 8 decimals. Within-day prices are rounded up. "]
[]
[null,"Reserve prices FIRM capacity for interconnection points","ENTRY REGULAR",{"$nulls":5},"ENTRY STORAGE",{"$nulls":5},"ENTRY LNG"]
[null,"Payable prices FIRM capacity for domestic points"]
[null,null,"Year","Quarter","Month","Day","Within-day",null,"Year","Quarter","Month","Day","Within-day",null,"Year","Quarter","Month","Day","Within-day"]
[null,null,"EUR/kWh/h/Y","EUR/kWh/h/Q","EUR/kWh/h/M","EUR/kWh/h/DA","EUR/kWh/h/WID",null,"EUR/kWh/h/Y","EUR/kWh/h/Q","EUR/kWh/h/M","EUR/kWh/h/DA","EUR/kWh/h/WID",null,"EUR/kWh/h/Y","EUR/kWh/h/Q","EUR/kWh/h/M","EUR/kWh/h/DA","EUR/kWh/h/WID"]
[]
[null,"Januari",5.48094638,2.50359119,{"v":1.1975117,"d":"1.19751170"},{"v":0.0465918,"d":"0.04659180"},{"v":1.94133E-3,"d":"0.00194133"},null,{"v":1.3702366,"d":"1.37023660"},{"v":0.6258978,"d":"0.62589780"},0.29937793,0.01164795,0.00048534,null,5.48094638,2.50359119,{"v":1.1975117,"d":"1.19751170"},{"v":0.0465918,"d":"0.04659180"},{"v":1.94133E-3,"d":"0.00194133"}]
[null,"Februari",null,null,0.96683894,0.04165144,{"v":1.73548E-3,"d":"0.00173548"},{"$nulls":3},0.24170974,0.01041286,0.00043387,{"$nulls":3},0.96683894,0.04165144,{"v":1.73548E-3,"d":"0.00173548"}]
[null,"Maart",null,null,0.83721081,0.03255907,0.00135663,{"$nulls":3},{"v":0.2093027,"d":"0.20930270"},0.00813977,{"v":3.3915999999999997E-4,"d":"0.00033916"},{"$nulls":3},0.83721081,0.03255907,0.00135663]
[null,"April",null,1.33915287,0.60410541,0.02428134,{"v":1.01173E-3,"d":"0.00101173"},null,null,0.33478822,0.15102635,0.00607034,{"v":2.5294E-4,"d":"0.00025294"},null,null,1.33915287,0.60410541,0.02428134,{"v":1.01173E-3,"d":"0.00101173"}]
[null,"Mei",null,null,0.55301998,{"v":0.0215221,"d":"0.02152210"},0.00089676,{"$nulls":3},{"v":0.138255,"d":"0.13825500"},0.00538052,0.00022419,{"$nulls":3},0.55301998,{"v":0.0215221,"d":"0.02152210"},0.00089676]
[null,"Juni",null,null,0.44936252,0.01807961,0.00075332,{"$nulls":3},0.11234063,{"v":0.0045199,"d":"0.00451990"},0.00018833,{"$nulls":3},0.44936252,0.01807961,0.00075332]
[null,"Juli",null,1.08620344,0.43850574,0.01705475,0.00071062,null,null,0.27155086,0.10962644,0.00426369,{"v":1.7766E-4,"d":"0.00017766"},null,null,1.08620344,0.43850574,0.01705475,0.00071062]
[null,"Augustus",null,null,0.41685976,0.01624012,0.00067668,{"$nulls":3},0.10421494,0.00406003,0.00016917,{"$nulls":3},0.41685976,0.01624012,0.00067668]
{"$rows_left_out":23}
{"sheet":"Neutrality charge","index":4,"n_rows":42,"n_cols":19,"rows_kept":42,"merged":[[7,2,7,6],[7,8,7,12],[7,14,7,18],[12,2,23,2],[12,3,14,3],[12,8,23,8],[12,9,14,9],[12,14,23,14],[12,15,14,15],[15,3,17,3],[15,9,17,9],[15,15,17,15],[18,3,20,3],[18,9,20,9],[18,15,20,15],[21,3,23,3],[21,9,23,9],[21,15,23,15],[25,2,25,6],[25,8,25,12],[30,2,41,2],[30,3,32,3],[30,8,41,8],[30,9,32,9],[33,3,35,3],[33,9,35,9],[36,3,38,3],[36,9,38,9],[39,3,41,3],[39,9,41,9]]}
[]
[]
[]
[null,"NEUTRALITY CHARGE 2027 (as established by GTS in accordance with calculation methodology as stated in the Transmission Code Gas - TSO)"]
[]
[null,"Charges are all rounded to 8 decimals. Within-day prices are rounded up. "]
[]
[null,"Charge FIRM capacity for interconnection points","ENTRY REGULAR",{"$nulls":5},"ENTRY STORAGE",{"$nulls":5},"ENTRY LNG"]
[null,"Payable charge FIRM capacity for domestic points"]
[null,null,"Year","Quarter","Month","Day","Within-day",null,"Year","Quarter","Month","Day","Within-day",null,"Year","Quarter","Month","Day","Within-day"]
[null,null,"EUR/kWh/h/Y","EUR/kWh/h/Q","EUR/kWh/h/M","EUR/kWh/h/DA","EUR/kWh/h/WID",null,"EUR/kWh/h/Y","EUR/kWh/h/Q","EUR/kWh/h/M","EUR/kWh/h/DA","EUR/kWh/h/WID",null,"EUR/kWh/h/Y","EUR/kWh/h/Q","EUR/kWh/h/M","EUR/kWh/h/DA","EUR/kWh/h/WID"]
[]
[null,"Januari",-0.00840974,{"v":-3.84141E-3,"d":"-0.00384141"},{"v":-1.83741E-3,"d":"-0.00183741"},{"v":-7.149e-05,"d":"-0.00007149"},{"v":-2.98e-06,"d":"-0.00000298"},null,-0.00210243,-0.00096035,-0.00045935,{"v":-1.787E-5,"d":"-0.00001787"},{"v":-7.5e-07,"d":"-0.00000075"},null,-0.00840974,{"v":-3.84141E-3,"d":"-0.00384141"},{"v":-1.83741E-3,"d":"-0.00183741"},{"v":-7.149e-05,"d":"-0.00007149"},{"v":-2.98e-06,"d":"-0.00000298"}]
[null,"Februari",null,null,-0.00148348,{"v":-6.391e-05,"d":"-0.00006391"},{"v":-2.67e-06,"d":"-0.00000267"},{"$nulls":3},-0.00037087,{"v":-1.598e-05,"d":"-0.00001598"},{"v":-6.7e-07,"d":"-0.00000067"},{"$nulls":3},-0.00148348,{"v":-6.391e-05,"d":"-0.00006391"},{"v":-2.67e-06,"d":"-0.00000267"}]
[null,"Maart",null,null,{"v":-1.28458E-3,"d":"-0.00128458"},{"v":-4.996e-05,"d":"-0.00004996"},{"v":-2.09e-06,"d":"-0.00000209"},{"$nulls":3},-0.00032115,{"v":-1.249e-05,"d":"-0.00001249"},{"v":-5.3e-07,"d":"-0.00000053"},{"$nulls":3},{"v":-1.28458E-3,"d":"-0.00128458"},{"v":-4.996e-05,"d":"-0.00004996"},{"v":-2.09e-06,"d":"-0.00000209"}]
[null,"April",null,-0.00205474,-0.00092691,{"v":-3.726e-05,"d":"-0.00003726"},{"v":-1.5599999999999999E-6,"d":"-0.00000156"},null,null,-0.00051369,-0.00023173,{"v":-9.31e-06,"d":"-0.00000931"},{"v":-3.9e-07,"d":"-0.00000039"},null,null,-0.00205474,-0.00092691,{"v":-3.726e-05,"d":"-0.00003726"},{"v":-1.5599999999999999E-6,"d":"-0.00000156"}]
[null,"Mei",null,null,-0.00084853,{"v":-3.302e-05,"d":"-0.00003302"},{"v":-1.38e-06,"d":"-0.00000138"},{"$nulls":3},-0.00021213,{"v":-8.26e-06,"d":"-0.00000826"},{"v":-3.5e-07,"d":"-0.00000035"},{"$nulls":3},-0.00084853,{"v":-3.302e-05,"d":"-0.00003302"},{"v":-1.38e-06,"d":"-0.00000138"}]
[null,"Juni",null,null,-0.00068948,{"v":-2.774e-05,"d":"-0.00002774"},{"v":-1.16e-06,"d":"-0.00000116"},{"$nulls":3},{"v":-1.7237E-4,"d":"-0.00017237"},{"v":-6.94e-06,"d":"-0.00000694"},{"v":-2.9000000000000003E-7,"d":"-0.00000029"},{"$nulls":3},-0.00068948,{"v":-2.774e-05,"d":"-0.00002774"},{"v":-1.16e-06,"d":"-0.00000116"}]
[null,"Juli",null,-0.00166663,-0.00067283,{"v":-2.617e-05,"d":"-0.00002617"},{"v":-1.0999999999999998E-6,"d":"-0.00000110"},null,null,-0.00041666,-0.00016821,{"v":-6.54e-06,"d":"-0.00000654"},{"v":-2.8e-07,"d":"-0.00000028"},null,null,-0.00166663,-0.00067283,{"v":-2.617e-05,"d":"-0.00002617"},{"v":-1.0999999999999998E-6,"d":"-0.00000110"}]
[null,"Augustus",null,null,-0.00063961,{"v":-2.492e-05,"d":"-0.00002492"},{"v":-1.04E-6,"d":"-0.00000104"},{"$nulls":3},{"v":-0.0001599,"d":"-0.00015990"},{"v":-6.23e-06,"d":"-0.00000623"},{"v":-2.6E-7,"d":"-0.00000026"},{"$nulls":3},-0.00063961,{"v":-2.492e-05,"d":"-0.00002492"},{"v":-1.04E-6,"d":"-0.00000104"}]
{"$rows_left_out":23}
{"sheet":"bladen rechts alleen voor inter","index":5,"n_rows":4,"n_cols":2,"rows_kept":4,"hidden":true}
[]
[]
[]
[null,"De tabbladen rechts zijn alleen voor intern gebruik beschikbaar. Voor extern gebruik zullen deze worden verborgen."]

{"sheet":"Optimisation","index":6,"n_rows":83,"n_cols":28,"rows_kept":83,"hidden":true,"merged":[[24,24,24,27],[25,15,25,16],[25,17,25,18],[25,19,25,21],[25,22,25,23],[56,5,56,8],[56,10,56,13]]}
[]
[]
[]
[null,"COLLECTING DATA FOR OPTIMALISATION"]
[]
[null,"Helping cell: row number","Numbers of months applicable","Month number","Final \nmonth","Year","Month \nname","Helping cell: \ncode Y&M","Days per month in desired period"]
[{"$nulls":11},"date","year","quarter","month","day"]
[null,0,null,{"$f":"O8","v":3},null,{"$f":"M8","v":2027},{"$f":"IF(D8=\"\",D8,INDEX(C$60:C$71,$D8,1))","v":"March"},{"$f":"CONCATENATE(F8,G8)","v":"2027March"},{"$f":"P19","v":31},null,"Start date",{"$f":"'Period booking'!D8","v":"2027-03-01"},{"$f":"YEAR(L8)","v":2027},"n.a.",{"$f":"MONTH(L8)","v":3},{"$f":"DAY(L8)","v":1}]
[null,{"$f":"B8+1","v":1},{"$f":"IF(B9>P$18,\"\",B9)","v":1},{"$f":"IF($C9=\"\",$C9,IF($D8+1=13,1,IF($D8+1>13,$D8+1-12,$D8+1)))","v":4},{"$f":"IF(AND(D10=\"\",D9<>\"\"),\"END\",\"\")","v":""},{"$f":"IF(D9=\"\",\"\",IF(AND($D9>$D8,$F8<$M$9),$M$8,$M$9))","v":2027},{"$f":"IF(D9=\"\",D9,INDEX(C$60:C$71,D9,1))","v":"April"},"2027April",{"$f":"IF($E9=\"END\",$P$9,IF($D9=\"\",\"\",VLOOKUP($H9,$D$60:$I$83,5,FALSE)))","v":30},null,"End date",{"$f":"'Period booking'!D9","v":"2027-07-01"},{"$f":"YEAR(L9)","v":2027},"n.a.",{"$f":"MONTH(L9)","v":7},{"$f":"DAY(L9)","v":1}]
[null,2,2,5,"",2027,"May","2027May",31]
[null,3,3,6,"",2027,"June","2027June",30,null,"Capacity",{"$nulls":3},"kWh/h",{"$f":"'Period booking'!D11","v":{"v":500000,"d":"500,000"}}]
[null,4,4,7,"END",2027,"July","2027July",1,null,"Applicable yearly reserve price",{"$nulls":3},"EUR/kWh/h/y",{"$f":"K60","v":{"v":5.09303642,"d":"5.0930"}}]
[null,5,"","","","","","","",null,"Payable amount in case of yearly (flat) booking",{"$nulls":3},"EUR/y",{"$f":"P11*P12","v":{"v":2546518.21,"d":"2,546,518"}}]
[null,6,"","","","","","","",null,"Payable amount after optimalisation",{"$nulls":3},"EUR/y",{"$f":"X53","v":{"v":1019090.43,"d":"1,019,090"}}]
[null,7,"","","","","","","",null,"Optimisation to yearly booking?",{"$nulls":4},{"$f":"IF(P13<P14,\"Yes\", \"No\")","v":"No"}]
[null,8,"","","","","","",""]
[null,9,"","","","","","","",null,"Check same month:",{"$nulls":4},{"$f":"IF(AND(M8=M9,O8=O9),\"ZELFDEMAAND\",\"No\")","v":"No"}]
[null,10,"","","","","","","",null,"Number of months involved after starting month:",{"$nulls":4},{"$f":"IF(($O$9-$O$8)>0,($O$9-$O$8),IF(($O$9-$O$8)<0,IF($P$8=1,12+($O$9-$O$8),12+($O$9-$O$8)),IF($M$9=$M$8,0,13)))","v":4}]
[null,11,"","","","","","","",null,"Number of days involved in starting month",{"$nulls":4},{"$f":"IF(P$17=\"ZELFDEMAAND\",$P$9-$P$8+1,_xlfn.DAYS(EOMONTH($L$8,0),$L$8)+1)","v":31}]
[null,12,"","","","","","",""]
{"$rows_left_out":64}
{"sheet":"Multipliers and SF","index":7,"n_rows":31,"n_cols":6,"rows_kept":31,"hidden":true}
[]
[]
[]
[null,"MULTIPLIERS AND SEASONAL FACTORS"]
[]
[null,"Multipliers (M)"]
[]
[null,"Quarterly multiplier","M-Q",1.25]
[null,"Monthly multiplier","M-M",1.5]
[null,"Daily multiplier","M-DA",1.75]
[null,"Within-day multiplier","M-WID",1.75]
[]
[null,"Seasonal factors (SF)",null,"Month","Day","WID"]
[]
[null,"SF - Jan",null,1.715,1.773,1.773]
[null,"SF - Feb",null,1.533,1.585,1.585]
[null,"SF - March",null,1.199,1.239,1.239]
[null,"SF - April",null,0.894,0.924,0.924]
[null,"SF - May",null,0.792,0.819,0.819]
[null,"SF - June",null,0.665,0.688,0.688]
{"$rows_left_out":12}
{"sheet":"Validation","index":8,"n_rows":15,"n_cols":3,"rows_kept":15,"hidden":true}
[]
[]
[]
[null,"VALIDATION POSTAGE STAMP POINTS"]
[]
[null,null,"Entry Regular"]
[null,null,"Entry Storage"]
[null,null,"Entry LNG"]
[null,null,"Exit non-storage"]
[null,null,"Exit storage"]
[]
[null,"VALIDATION FEBRUARY IN LEAP YEAR"]
[]
[null,null,"Yes"]
[null,null,"No"]