{"text_format":"3","workbook":"xlsx","n_sheets":11,"sheets":["EXPLANATION","Profiled booking","Total prices","Transmission tariffs","Neutrality charge","Booking in Y-Q-M products","Monthly invoice","bladen rechts alleen voor inter","Multipliers and SF","Validation","Optimisation"],"not_rendered":{"charts":7,"images":8,"macros":1,"external_links":1,"defined_names":8},"read":"whole","date_system":"1900"}

{"sheet":"EXPLANATION","index":0,"n_rows":72,"n_cols":9,"rows_kept":72,"merged":[[13,1,13,2],[14,1,14,2],[15,1,15,2],[16,1,16,2],[17,1,17,2],[22,1,24,10],[26,1,29,10],[31,2,33,10],[35,2,37,10],[39,2,41,10],[51,2,53,10],[57,2,58,10],[60,2,61,10],[66,2,67,10],[71,1,73,10]]}
[]
[]
[]
[null,"DISCLAIMER"]
[]
[null,"- GTS only provide's this file as service, no rights whatsoever may be derived from these calculations, shipper' bookings and GTS Invoices are leading."]
[null,"- Tariff used in the calculation are the tariffs for 2025 as established by the Dutch regulator ACM (24 May 2024): "]
[null,null,"https://www.gasunietransportservices.nl/en/news/tariffs-decision-2024"]
[null,"- Multipliers and seasonal factors used as establish by the Duth regulator ACM in the NC TAR decision (25 April 2024):"]
[null,null,"https://www.acm.nl/nl/publicaties/codebesluit-ter-uitvoering-van-nc-tar",{"$nulls":5},"(Dutch)"]
[]
[null,"LEGEND"]
[]
[null,"GREEN",null,null,"Input cells to be filled out by user"]
[null,"BLUE",null,null,"Fixed input data"]
{"$rows_left_out":58}
{"sheet":"Profiled booking","index":1,"n_rows":24,"n_cols":5,"rows_kept":24,"merged":[[3,1,4,10],[8,4,9,11]]}
[]
[]
[]
[null,"CALCULATION TOOL FOR OPTIMISATION  OF PROFILED BOOKINGS \nINTO YEARLY, QUARTERLY AND MONTHLY FIRM CAPACITY PRODUCTS"]
[]
[]
[null,"Postage stamp point","Exit non-storage",null,"Please fill in the appropriate values in the GREEN fields and click on button below for output"]
[null,"Starting month","January",null,{"$f":"IF(OR($C$8=$B$14,$C$8=$B$15),\"Please be aware that with this starting month it is not possible to contract the quarterly capacity product January-March\",IF(OR($C$8=$B$17,$C$8=$B$18),\"Please be aware that with this starting month it is not possible to contract the quarterly capacity product April-June\",IF(OR($C$8=$B$20,$C$8=$B$21),\"Please be aware that with this starting month it is not possible to contract the quarterly capacity product July-September\",IF(OR($C$8=$B$23,$C$8=$B$24),\"Please be aware that with this starting month it is not possible to contract the quarterly capacity product October-December\",\"\"))))","v":""}]
[null,"February capacity in leap year?","No",null,{"$f":"IF(OR(C13<0,C14<0,C15<0,C16<0,C17<0,C18<0,C19<0,C20<0,C21<0,C22<0,C23<0,C24<0),\"WARNING: calculation is not reliable due to negative value(s) in desired profiled booking, please correct to positive values! \nIn case of no correction, all negative values are automatically converted to zero (0) in the calculation.\",\"\")","v":""}]
[]
[null,"Month","Desired profiled \ncapacity booking"]
[null,null,"kWh/h/y"]
[null,"January",{"v":7000000,"d":"7,000,000"}]
[null,"February",{"v":7000000,"d":"7,000,000"}]
[null,"March",{"v":6000000,"d":"6,000,000"}]
{"$rows_left_out":10}
{"sheet":"Total prices","index":2,"n_rows":100,"n_cols":19,"rows_kept":100,"merged":[[7,2,7,6],[7,8,7,12],[7,14,7,18],[12,2,23,2],[12,3,14,3],[12,8,23,8],[12,9,14,9],[12,14,23,14],[12,15,14,15],[15,3,17,3],[15,9,17,9],[15,15,17,15],[18,3,20,3],[18,9,20,9],[18,15,20,15],[21,3,23,3],[21,9,23,9],[21,15,23,15],[25,2,25,6],[25,8,25,12],[30,2,41,2],[30,3,32,3],[30,8,41,8],[30,9,32,9],[33,3,35,3],[33,9,35,9],[36,3,38,3],[36,9,38,9],[39,3,41,3],[39,9,41,9]]}
[]
[]
[]
[null,"TOTAL PRICES 2025 FIRM CAPACITY (which is sum of the all-in transmission tariffs and the neutrality charges)"]
[]
[null,"Tariffs are all rounded to 8 decimals. Within-day prices are rounded up. "]
[]
[null,"Total prices FIRM capacity for interconnection points","ENTRY REGULAR",{"$nulls":5},"ENTRY STORAGE",{"$nulls":5},"ENTRY LNG"]
[null,"Payable total prices FIRM capacity for domestic points"]
[null,null,"Year","Quarter","Month","Day","Within-day",null,"Year","Quarter","Month","Day","Within-day",null,"Year","Quarter","Month","Day","Within-day"]
[null,null,"EUR/kWh/h/Y","EUR/kWh/h/Q","EUR/kWh/h/M","EUR/kWh/h/DA","EUR/kWh/h/WID",null,"EUR/kWh/h/Y","EUR/kWh/h/Q","EUR/kWh/h/M","EUR/kWh/h/DA","EUR/kWh/h/WID",null,"EUR/kWh/h/Y","EUR/kWh/h/Q","EUR/kWh/h/M","EUR/kWh/h/DA","EUR/kWh/h/WID"]
[]
[null,"January",{"$f":"'Transmission tariffs'!C13+'Neutrality charge'!C13","v":3.75101857},{"$f":"'Transmission tariffs'!D13+'Neutrality charge'!D13","v":{"v":1.7133933399999999,"d":"1.71339334"}},{"$f":"'Transmission tariffs'!E13+'Neutrality charge'!E13","v":{"v":0.8195461700000001,"d":"0.81954617"}},{"$f":"'Transmission tariffs'!F13+'Neutrality charge'!F13","v":{"v":0.031886229999999995,"d":"0.03188623"}},{"$f":"'Transmission tariffs'!G13+'Neutrality charge'!G13","v":0.00132859},null,{"$f":"'Transmission tariffs'!I13+'Neutrality charge'!I13","v":0.93775464},{"$f":"'Transmission tariffs'!J13+'Neutrality charge'!J13","v":0.42834834},{"$f":"'Transmission tariffs'!K13+'Neutrality charge'!K13","v":0.20488655},{"$f":"'Transmission tariffs'!L13+'Neutrality charge'!L13","v":{"v":0.007971559999999999,"d":"0.00797156"}},{"$f":"'Transmission tariffs'!M13+'Neutrality charge'!M13","v":0.00033215},null,{"$f":"'Transmission tariffs'!O13+'Neutrality charge'!O13","v":3.00081485},{"$f":"'Transmission tariffs'!P13+'Neutrality charge'!P13","v":1.37071468},{"$f":"'Transmission tariffs'!Q13+'Neutrality charge'!Q13","v":0.65563694},{"$f":"'Transmission tariffs'!R13+'Neutrality charge'!R13","v":0.02550898},{"$f":"'Transmission tariffs'!S13+'Neutrality charge'!S13","v":{"v":1.0628699999999998E-3,"d":"0.00106287"}}]
[null,"February",null,null,{"$f":"'Transmission tariffs'!E14+'Neutrality charge'!E14","v":{"v":0.6616796699999999,"d":"0.66167967"}},{"$f":"'Transmission tariffs'!F14+'Neutrality charge'!F14","v":{"v":0.028505170000000003,"d":"0.02850517"}},{"$f":"'Transmission tariffs'!G14+'Neutrality charge'!G14","v":{"v":1.18772E-3,"d":"0.00118772"}},{"$nulls":3},{"$f":"'Transmission tariffs'!K14+'Neutrality charge'!K14","v":0.16541992},{"$f":"'Transmission tariffs'!L14+'Neutrality charge'!L14","v":0.00712629},{"$f":"'Transmission tariffs'!M14+'Neutrality charge'!M14","v":0.00029693},{"$nulls":3},{"$f":"'Transmission tariffs'!Q14+'Neutrality charge'!Q14","v":{"v":0.5293437499999999,"d":"0.52934375"}},{"$f":"'Transmission tariffs'!R14+'Neutrality charge'!R14","v":0.02280413},{"$f":"'Transmission tariffs'!S14+'Neutrality charge'!S14","v":{"v":9.5018000000000012E-4,"d":"0.00095018"}}]
[null,"March",null,null,{"$f":"'Transmission tariffs'!E15+'Neutrality charge'!E15","v":0.57296552},{"$f":"'Transmission tariffs'!F15+'Neutrality charge'!F15","v":{"v":0.022282589999999998,"d":"0.02228259"}},{"$f":"'Transmission tariffs'!G15+'Neutrality charge'!G15","v":{"v":9.284400000000001E-4,"d":"0.00092844"}},{"$nulls":3},{"$f":"'Transmission tariffs'!K15+'Neutrality charge'!K15","v":0.14324138},{"$f":"'Transmission tariffs'!L15+'Neutrality charge'!L15","v":0.00557065},{"$f":"'Transmission tariffs'!M15+'Neutrality charge'!M15","v":{"v":2.3211E-4,"d":"0.00023211"}},{"$nulls":3},{"$f":"'Transmission tariffs'!Q15+'Neutrality charge'!Q15","v":0.45837241},{"$f":"'Transmission tariffs'!R15+'Neutrality charge'!R15","v":0.01782608},{"$f":"'Transmission tariffs'!S15+'Neutrality charge'!S15","v":0.00074275}]
{"$rows_left_out":55}
{"sheet":"Transmission tariffs","index":3,"n_rows":100,"n_cols":19,"rows_kept":100,"merged":[[7,2,7,6],[7,8,7,12],[7,14,7,18],[12,2,23,2],[12,3,14,3],[12,8,23,8],[12,9,14,9],[12,14,23,14],[12,15,14,15],[15,3,17,3],[15,9,17,9],[15,15,17,15],[18,3,20,3],[18,9,20,9],[18,15,20,15],[21,3,23,3],[21,9,23,9],[21,15,23,15],[25,2,25,6],[25,8,25,12],[30,2,41,2],[30,3,32,3],[30,8,41,8],[30,9,32,9],[33,3,35,3],[33,9,35,9],[36,3,38,3],[36,9,38,9],[39,3,41,3],[39,9,41,9]]}
[]
[]
[]
[null,"ALL-IN TRANSMISSION TARIFFS 2025 (as established by the Dutch regulator ACM)"]
[]
[null,"Tariffs are all rounded to 8 decimals. Within-day prices are rounded up. "]
[]
[null,"Reserve prices FIRM capacity for interconnection points","ENTRY REGULAR",{"$nulls":5},"ENTRY STORAGE",{"$nulls":5},"ENTRY LNG"]
[null,"Payable prices FIRM capacity for domestic points"]
[null,null,"Year","Quarter","Month","Day","Within-day",null,"Year","Quarter","Month","Day","Within-day",null,"Year","Quarter","Month","Day","Within-day"]
[null,null,"EUR/kWh/h/Y","EUR/kWh/h/Q","EUR/kWh/h/M","EUR/kWh/h/DA","EUR/kWh/h/WID",null,"EUR/kWh/h/Y","EUR/kWh/h/Q","EUR/kWh/h/M","EUR/kWh/h/DA","EUR/kWh/h/WID",null,"EUR/kWh/h/Y","EUR/kWh/h/Q","EUR/kWh/h/M","EUR/kWh/h/DA","EUR/kWh/h/WID"]
[]
[null,"Januari",{"v":3.758397,"d":"3.75839700"},1.71676367,0.82115826,0.03194895,{"v":1.33121E-3,"d":"0.00133121"},null,0.93959925,0.42919092,0.20528957,0.00798724,0.00033281,null,{"v":3.0067176,"d":"3.00671760"},1.37341094,0.65692661,0.02555916,0.00106497]
[null,"Februari",null,null,0.66298123,0.02856124,0.00119006,{"$nulls":3},0.16574531,0.00714031,0.00029752,{"$nulls":3},0.53038499,0.02284899,{"v":9.5205000000000008E-4,"d":"0.00095205"}]
[null,"Maart",null,null,0.57409257,0.02232642,{"v":9.3027000000000008E-4,"d":"0.00093027"},{"$nulls":3},0.14352314,0.00558161,{"v":2.3257E-4,"d":"0.00023257"},{"$nulls":3},0.45927405,0.01786114,{"v":7.4422000000000008E-4,"d":"0.00074422"}]
{"$rows_left_out":55}
{"sheet":"Neutrality charge","index":4,"n_rows":100,"n_cols":19,"rows_kept":100,"merged":[[7,2,7,6],[7,8,7,12],[7,14,7,18],[12,2,23,2],[12,3,14,3],[12,8,23,8],[12,9,14,9],[12,14,23,14],[12,15,14,15],[15,3,17,3],[15,9,17,9],[15,15,17,15],[18,3,20,3],[18,9,20,9],[18,15,20,15],[21,3,23,3],[21,9,23,9],[21,15,23,15],[25,2,25,6],[25,8,25,12],[30,2,41,2],[30,3,32,3],[30,8,41,8],[30,9,32,9],[33,3,35,3],[33,9,35,9],[36,3,38,3],[36,9,38,9],[39,3,41,3],[39,9,41,9]]}
[]
[]
[]
[null,"NEUTRALITY CHARGE 2025 (as established by GTS in accordance with calculation methodology as stated in the Transmission Code Gas - TSO)"]
[]
[null,"Charges are all rounded to 8 decimals. Within-day prices are rounded up. "]
[]
[null,"Charge FIRM capacity for interconnection points","ENTRY REGULAR",{"$nulls":5},"ENTRY STORAGE",{"$nulls":5},"ENTRY LNG"]
[null,"Payable charge FIRM capacity for domestic points"]
[null,null,"Year","Quarter","Month","Day","Within-day",null,"Year","Quarter","Month","Day","Within-day",null,"Year","Quarter","Month","Day","Within-day"]
[null,null,"EUR/kWh/h/Y","EUR/kWh/h/Q","EUR/kWh/h/M","EUR/kWh/h/DA","EUR/kWh/h/WID",null,"EUR/kWh/h/Y","EUR/kWh/h/Q","EUR/kWh/h/M","EUR/kWh/h/DA","EUR/kWh/h/WID",null,"EUR/kWh/h/Y","EUR/kWh/h/Q","EUR/kWh/h/M","EUR/kWh/h/DA","EUR/kWh/h/WID"]
[]
[null,"Januari",-0.00737843,-0.00337033,-0.00161209,{"v":-6.272e-05,"d":"-0.00006272"},{"v":-2.62e-06,"d":"-0.00000262"},null,{"v":-1.84461E-3,"d":"-0.00184461"},{"v":-8.4258E-4,"d":"-0.00084258"},-0.00040302,{"v":-1.568e-05,"d":"-0.00001568"},{"v":-6.6e-07,"d":"-0.00000066"},null,{"v":-5.90275E-3,"d":"-0.00590275"},-0.00269626,-0.00128967,{"v":-5.018e-05,"d":"-0.00005018"},{"v":-2.1e-06,"d":"-0.00000210"}]
[null,"Februari",null,null,{"v":-1.30156E-3,"d":"-0.00130156"},{"v":-5.607e-05,"d":"-0.00005607"},{"v":-2.34E-6,"d":"-0.00000234"},{"$nulls":3},{"v":-3.2539E-4,"d":"-0.00032539"},{"v":-1.402E-5,"d":"-0.00001402"},{"v":-5.9e-07,"d":"-0.00000059"},{"$nulls":3},-0.00104124,{"v":-4.486e-05,"d":"-0.00004486"},{"v":-1.8699999999999999E-6,"d":"-0.00000187"}]
[null,"Maart",null,null,-0.00112705,{"v":-4.383e-05,"d":"-0.00004383"},{"v":-1.8299999999999998E-6,"d":"-0.00000183"},{"$nulls":3},-0.00028176,{"v":-1.096E-5,"d":"-0.00001096"},{"v":-4.6e-07,"d":"-0.00000046"},{"$nulls":3},-0.00090164,{"v":-3.506E-5,"d":"-0.00003506"},{"v":-1.47e-06,"d":"-0.00000147"}]
{"$rows_left_out":55}
{"sheet":"Booking in Y-Q-M products","index":5,"n_rows":26,"n_cols":16,"rows_kept":26,"merged":[[5,1,5,2],[5,5,5,8],[9,5,9,9],[9,11,9,15]]}
[]
[]
[]
[null,"CONVERTED PROFILED BOOKING INTO YEARLY, QUARTERLY AND MONTHLY CAPACITY PRODUCTS AND optimised CAPACITY PRODUCTS"]
[]
[null,"DESIRED PROFILED CAPACITY BOOKING",{"$nulls":3},"YOUR SAVINGS DUE TO OPTIMISATION",{"$nulls":3},{"$f":"J26-P26","v":{"v":1646019.9699999988,"d":"€ 1,646,020"}}]
[]
[null,"Postage stamp point",{"$f":"'Profiled booking'!C7","v":"Exit non-storage"}]
[null,"Starting month",{"$f":"'Profiled booking'!C8","v":"January"}]
[null,"February capacity in leap year",{"$f":"'Profiled booking'!C9","v":"No"},null,null,"PROFILED BOOKING CONVERTED INTO Y, Q, M CAPACITY PRODUCTS",{"$nulls":5},"PROFILE BOOKING optimised INTO Y, Q, M CAPACITY PRODUCTS"]
[]
[null,"Month","Desired profiled capacity booking",null,null,"Yearly capacity booking","Quarterly capacity booking","Monthly capacity booking","Total capacity booking","Expected monthly invoice",null,"Yearly capacity booking","Quarterly capacity booking","Monthly capacity booking","Total capacity booking","Expected monthly invoice"]
[null,null,"kWh/h/y",null,null,"kWh/h","kWh/h","kWh/h","kWh/h","EUR",null,"kWh/h","kWh/h","kWh/h","kWh/h","EUR"]
[null,"January",{"$f":"IF('Profiled booking'!C13<0,0,'Profiled booking'!C13)","v":{"v":7000000,"d":"7,000,000"}},null,null,{"$f":"Optimisation!E11","v":{"v":1000000,"d":"1,000,000"}},{"$f":"Optimisation!F11","v":{"v":5000000,"d":"5,000,000"}},{"$f":"Optimisation!G11","v":{"v":1000000,"d":"1,000,000"}},{"$f":"SUM(F14:H14)","v":{"v":7000000,"d":"7,000,000"}},{"$f":"Optimisation!H62","v":{"v":3574976.005452055,"d":"€ 3,574,976"}},null,{"$f":"Optimisation!J11","v":{"v":5000000,"d":"5,000,000"}},{"$f":"Optimisation!K11","v":{"v":1000000,"d":"1,000,000"}},{"$f":"Optimisation!L11","v":{"v":1000000,"d":"1,000,000"}},{"$f":"SUM(L14:N14)","v":{"v":7000000,"d":"7,000,000"}},{"$f":"Optimisation!M62","v":{"v":2625177.163260274,"d":"€ 2,625,177"}}]
[null,"February",{"$f":"IF('Profiled booking'!C14<0,0,'Profiled booking'!C14)","v":{"v":7000000,"d":"7,000,000"}},null,null,{"$f":"Optimisation!E12","v":{"v":1000000,"d":"1,000,000"}},{"$f":"Optimisation!F12","v":{"v":5000000,"d":"5,000,000"}},{"$f":"Optimisation!G12","v":{"v":1000000,"d":"1,000,000"}},{"v":7000000,"d":"7,000,000"},{"$f":"Optimisation!H63","v":{"v":3160329.63169863,"d":"€ 3,160,330"}},null,{"$f":"Optimisation!J12","v":{"v":5000000,"d":"5,000,000"}},{"$f":"Optimisation!K12","v":{"v":1000000,"d":"1,000,000"}},{"$f":"Optimisation!L12","v":{"v":1000000,"d":"1,000,000"}},{"v":7000000,"d":"7,000,000"},{"$f":"Optimisation!M63","v":{"v":2302446.806493151,"d":"€ 2,302,447"}}]
{"$rows_left_out":12}
{"sheet":"Monthly invoice","index":6,"n_rows":44,"n_cols":14,"rows_kept":44,"merged":[[5,1,5,2],[5,5,5,7],[9,5,9,8],[9,10,9,13],[27,1,27,3],[27,5,27,8],[27,10,27,13],[29,1,29,3],[30,1,30,3],[31,1,42,1],[31,2,33,2],[31,5,42,5],[31,6,33,6],[31,10,42,10],[31,11,33,11],[34,2,36,2],[34,6,36,6],[34,11,36,11],[37,2,39,2],[37,6,39,6],[37,11,39,11],[40,2,42,2],[40,6,42,6],[40,11,42,11]]}
[]
[]
[]
[null,"CONVERTED PROFILED BOOKING INTO NON-optimised AND optimised CAPACITY PRODUCTS"]
[]
[null,"DESIRED PROFILED CAPACITY BOOKING",{"$nulls":3},"YOUR SAVINGS DUE TO OPTIMISATION",null,null,{"$f":"I44-N44","v":{"v":1646019.9699999988,"d":"€ 1,646,020"}}]
[]
[null,"Postage stamp point",{"$f":"'Profiled booking'!C7","v":"Exit non-storage"}]
[null,"Starting month",{"$f":"'Profiled booking'!C8","v":"January"}]
[null,"February capacity in leap year",{"$f":"'Profiled booking'!C9","v":"No"},null,null,"PROFILED BOOKING CONVERTED INTO Y, Q, M CAPACITY PRODUCTS",{"$nulls":4},"PROFILE BOOKING optimised INTO Y, Q, M CAPACITY PRODUCTS"]
[]
[null,"Month","Desired profiled capacity booking",null,null,"Yearly capacity booking","Quarterly capacity booking","Monthly capacity booking","Total capacity booking",null,"Yearly capacity booking","Quarterly capacity booking","Monthly capacity booking","Total capacity booking"]
[null,null,"kWh/h/y",null,null,"kWh/h","kWh/h","kWh/h","kWh/h",null,"kWh/h","kWh/h","kWh/h","kWh/h"]
[null,"January",{"$f":"IF('Profiled booking'!C13<0,0,'Profiled booking'!C13)","v":{"v":7000000,"d":"7,000,000"}},null,null,{"$f":"Optimisation!E11","v":{"v":1000000,"d":"1,000,000"}},{"$f":"Optimisation!F11","v":{"v":5000000,"d":"5,000,000"}},{"$f":"Optimisation!G11","v":{"v":1000000,"d":"1,000,000"}},{"$f":"SUM(F14:H14)","v":{"v":7000000,"d":"7,000,000"}},null,{"$f":"Optimisation!J11","v":{"v":5000000,"d":"5,000,000"}},{"$f":"Optimisation!K11","v":{"v":1000000,"d":"1,000,000"}},{"$f":"Optimisation!L11","v":{"v":1000000,"d":"1,000,000"}},{"$f":"SUM(K14:M14)","v":{"v":7000000,"d":"7,000,000"}}]
[null,"February",{"$f":"IF('Profiled booking'!C14<0,0,'Profiled booking'!C14)","v":{"v":7000000,"d":"7,000,000"}},null,null,{"$f":"Optimisation!E12","v":{"v":1000000,"d":"1,000,000"}},{"$f":"Optimisation!F12","v":{"v":5000000,"d":"5,000,000"}},{"$f":"Optimisation!G12","v":{"v":1000000,"d":"1,000,000"}},{"v":7000000,"d":"7,000,000"},null,{"$f":"Optimisation!J12","v":{"v":5000000,"d":"5,000,000"}},{"$f":"Optimisation!K12","v":{"v":1000000,"d":"1,000,000"}},{"$f":"Optimisation!L12","v":{"v":1000000,"d":"1,000,000"}},{"v":7000000,"d":"7,000,000"}]
{"$rows_left_out":30}
{"sheet":"bladen rechts alleen voor inter","index":7,"n_rows":4,"n_cols":2,"rows_kept":4,"hidden":true}
[]
[]
[]
[null,"De tabbladen rechts zijn alleen voor intern gebruik beschikbaar. Voor extern gebruik zullen deze worden verborgen."]

{"sheet":"Multipliers and SF","index":8,"n_rows":31,"n_cols":6,"rows_kept":31,"hidden":true}
[]
[]
[]
[null,"MULTIPLIERS AND SEASONAL FACTORS"]
[]
[null,"Multipliers (M)"]
[]
[null,"Quarterly multiplier","M-Q",1.25]
[null,"Monthly multiplier","M-M",1.5]
[null,"Daily multiplier","M-DA",1.75]
[null,"Within-day multiplier","M-WID",1.75]
[]
[null,"Seasonal factors (SF)",null,"Month","Day","WID"]
[]
[null,"SF - Jan",null,1.715,1.773,1.773]
{"$rows_left_out":17}
{"sheet":"Validation","index":9,"n_rows":15,"n_cols":3,"rows_kept":15,"hidden":true}
[]
[]
[]
[null,"VALIDATION POSTAGE STAMP POINTS"]
[]
[null,null,"Entry regular"]
[null,null,"Entry storage"]
[null,null,"Entry LNG"]
[null,null,"Exit non-storage"]
[null,null,"Exit storage"]
[]
[null,"VALIDATION FEBRUARY IN LEAP YEAR"]
[]
[null,null,"Yes"]
[null,null,"No"]
{"$rows_left_out":1}
{"sheet":"Optimisation","index":10,"n_rows":227,"n_cols":30,"rows_kept":227,"hidden":true,"merged":[[6,4,6,7],[6,9,6,12],[43,4,43,7],[43,9,43,12],[47,4,58,4],[47,5,49,5],[47,9,58,9],[47,10,49,10],[50,5,52,5],[50,10,52,10],[53,5,55,5],[53,10,55,10],[56,5,58,5],[56,10,58,10],[61,4,72,4],[61,5,63,5],[61,9,72,9],[61,10,63,10],[64,5,66,5],[64,10,66,10],[67,5,69,5],[67,10,69,10],[70,5,72,5],[70,10,72,10],[70,14,72,14],[77,1,77,3],[78,1,89,1],[78,2,80,2],[81,2,83,2],[84,2,86,2],[87,2,89,2]]}
[]
[]
[]
[]
[null,"PROFILED BOOKING CAPACITY PRODUCTS: NON-OPTIMIZED vs OPTIMIZED"]
[]
[{"$nulls":4},"PROFILE BOOKING WITHOUT optimisation",{"$nulls":4},"PROFILE BOOKING WITH optimisation"]
[]
[null,null,"Profiled capacity booking",null,"Yearly capacity booking","Quarterly capacity booking","Monthly capacity booking","Total capacity booking",null,"Yearly capacity booking","Quarterly capacity booking","Monthly capacity booking","Total capacity booking"]
[null,null,"kWh/h",null,"kWh/h","kWh/h","kWh/h","kWh/h",null,"kWh/h","kWh/h","kWh/h","kWh/h"]
[null,"January",{"$f":"IF('Profiled booking'!C13<0,0,'Profiled booking'!C13)","v":{"v":7000000,"d":"7,000,000"}},null,{"$f":"F130","v":{"v":1000000,"d":"1,000,000"}},{"$f":"G130","v":{"v":5000000,"d":"5,000,000"}},{"v":1000000,"d":"1,000,000"},{"$f":"SUM(E11:G11)","v":{"v":7000000,"d":"7,000,000"}},null,{"$f":"F216","v":{"v":5000000,"d":"5,000,000"}},{"$f":"G216","v":{"v":1000000,"d":"1,000,000"}},{"$f":"H216","v":{"v":1000000,"d":"1,000,000"}},{"$f":"SUM(J11:L11)","v":{"v":7000000,"d":"7,000,000"}}]
[null,"February",{"$f":"IF('Profiled booking'!C14<0,0,'Profiled booking'!C14)","v":{"v":7000000,"d":"7,000,000"}},null,{"$f":"F131","v":{"v":1000000,"d":"1,000,000"}},{"v":5000000,"d":"5,000,000"},{"v":1000000,"d":"1,000,000"},{"v":7000000,"d":"7,000,000"},null,{"v":5000000,"d":"5,000,000"},{"v":1000000,"d":"1,000,000"},{"v":1000000,"d":"1,000,000"},{"v":7000000,"d":"7,000,000"}]
[null,"March",{"$f":"IF('Profiled booking'!C15<0,0,'Profiled booking'!C15)","v":{"v":6000000,"d":"6,000,000"}},null,{"v":1000000,"d":"1,000,000"},{"v":5000000,"d":"5,000,000"},0,{"v":6000000,"d":"6,000,000"},null,{"v":5000000,"d":"5,000,000"},{"v":1000000,"d":"1,000,000"},0,{"v":6000000,"d":"6,000,000"}]
[null,"April",{"$f":"IF('Profiled booking'!C16<0,0,'Profiled booking'!C16)","v":{"v":6000000,"d":"6,000,000"}},null,{"v":1000000,"d":"1,000,000"},0,{"v":5000000,"d":"5,000,000"},{"v":6000000,"d":"6,000,000"},null,{"v":5000000,"d":"5,000,000"},0,{"v":1000000,"d":"1,000,000"},{"v":6000000,"d":"6,000,000"}]
[null,"May",{"$f":"IF('Profiled booking'!C17<0,0,'Profiled booking'!C17)","v":{"v":5000000,"d":"5,000,000"}},null,{"v":1000000,"d":"1,000,000"},0,{"v":4000000,"d":"4,000,000"},{"v":5000000,"d":"5,000,000"},null,{"v":5000000,"d":"5,000,000"},0,0,{"v":5000000,"d":"5,000,000"}]
{"$rows_left_out":195}