{"text_format":"3","workbook":"xlsx","n_sheets":8,"sheets":["EXPLANATION","Period booking","Total prices","Transmission tariffs","Neutrality charge","Optimalisation","Multipliers and SF","Validation"],"not_rendered":{"images":9,"macros":1,"defined_names":5},"read":"whole","date_system":"1900"}

{"sheet":"EXPLANATION","index":0,"n_rows":66,"n_cols":9,"rows_kept":66,"merged":[[16,1,16,2],[17,1,17,2],[18,1,18,2],[19,1,19,2],[20,1,20,2],[25,1,27,10],[29,1,32,10],[34,2,36,10],[38,2,40,10],[42,2,44,10],[48,2,48,10],[50,2,51,10],[53,2,54,10],[56,2,58,10],[61,1,62,10],[65,1,67,10]]}
[]
[]
[]
[null,"DISCLAIMER"]
[]
[null,"- GTS only provide's this file as service, no rights whatsoever may be derived from these calculations, shipper' bookings and GTS Invoices are leading."]
[null,"- Tariffs used in the calculation are the total prices for 2026"]
[null,"- Total price is the sum of the all-in transmission tariff and the neutrality charge, whereby:"]
[null,"- transmission tariffs for 2026 are established by the Dutch regulator ACM (26 May 2025)"]
[null,"- neutrality charges for 2026 are established by GTS in accordance with the calculation methodology as stated in de Transmission Code Gas TSO"]
[null,null,"https://www.gasunietransportservices.nl/en/news/tariff-decision-2026"]
[null,"- Multipliers and seasonal factors used as established by the Duth regulator ACM in the NC TAR decision (25 April 2024):"]
[null,null,"https://www.acm.nl/nl/publicaties/codebesluit-ter-uitvoering-van-nc-tar",{"$nulls":5},"(Dutch)"]
[]
[null,"LEGEND"]
[]
[null,"GREEN",null,null,"Input cells to be filled out by user"]
[null,"BLUE",null,null,"Fixed input data"]
[null,"YELLOW",null,null,"Calculated value "]
[null,"ORANGE",null,null,"Calculated resulting value"]
[null,"BLACK",null,null,"Information sheets (this explanation sheet and sheets with calculation of the total prices)"]
[]
[null,"EXPLANATION CALCULATION TOOL PERIOD BOOKING"]
[]
[null,"Introduction"]
[null,"This tool converts a flat (non-profiled) booking for a booking period of less than one year into an optimum combination of yearly, quarterly, monthly and daily capacity products. The tool determines the cheapest combination in line with (a) - (c) of the 'optimisation paragraphs' of described in article 2.1.2. of the Transmission Code Gas TSO (quote): "]
[]
[]
[]
[null,"“If a recognised programme-responsible party or connected parties with exit capacity at domestic entry and exit points contract entry or exit capacity at an entry or exit point on the same day in any given combination of quarterly, monthly, and daily capacity products, the network operator of the national gas transmission grid shall, at the request of the recognised programme-responsible party or connected parties with exit capacity, do the following for each tranche of the same quantity of contracted entry or exit capacity: "]
[]
[]
[]
[]
[null,"a.","If the payable price for the combination of contracted quarterly, monthly, and daily capacity products is greater than the price of a yearly capacity product, then the yearly capacity product shall be contracted for the tranche in question, provided the required capacity is available at the relevant entry or exit point; "]
[]
[]
[]
[null,"b.","If the payable price for the combination of contracted monthly and daily capacity products in one gas quarter is greater than the price of the relevant quarterly capacity product, then the relevant quarterly capacity product shall be contracted, provided the required capacity is available at the relevant entry or exit point; or "]
[]
[]
[]
[null,"c.","If the payable price for the combination of contracted daily capacity products in one month is greater than the payable price for the monthly capacity product, then the relevant monthly capacity product shall be contracted, provided the required capacity is available at the relevant entry or exit point.”"]
[]
[]
[]
[null,"The main steps in the optimisation are"]
[]
[null,"*","the period booking is converted into non-optimised subsequent capacity products;"]
[]
[null,"*","if the payable price for the combination of daily capacity products in one month is greater than the payable price for the monthly capacity product, then the relevant monthly capacity products applies;"]
[]
[]
[null,"*","if the payable price for the combination of monthly and daily capacity products in one gas quarter is greater than the price of the relevant quarterly capacity products, then the relevant quarterly capacity product applies;"]
[]
[]
[null,"*","if the payable price for the combination of quarterly, monthly and daily capacity products is greater than the price for a yearly capacity product, then the relevant yearly capacity product applies. When the by the shipper chosen period leads to less than 12 consecutive months in the yearly booking, shipper is requested to adjust the start or end date creating 12 consecutive months in the yearly booking."]
[]
[]
[]
[null,"Output"]
[null,"For the period of shipper’s choosing the resulting capacity products are shown including the corresponding estimated monthly invoice \n(based on 2026 total price)."]
[]
[]
[null,"Disclaimer"]
[null,"This calculation tool advises shippers the cheapest combination of capacity products, based on the given input. Shippers obviously remain responsible for (timely) contracting the right (combination of) capacity products themselves. No rights or whatsoever can be derived from this calculation tool. "]

{"sheet":"Period booking","index":1,"n_rows":42,"n_cols":8,"rows_kept":42,"merged":[[3,1,4,10],[12,1,12,7],[17,13,17,14]]}
[]
[]
[]
[null,"CALCULATION TOOL FOR OPTIMISATION OF PERIOD BOOKINGS INTO (Y, Q, M, DA) FIRM CAPACITY PRODUCTS"]
[]
[null,"Please fill in the appropriate values in the GREEN fields and find the optimalisation results below"]
[]
[null,"Start date",{"$f":"IF(OR(ISERROR(DAY($D$8)),ISERROR(DAY($D$9))),1,IF(OR($D$9<$D$8,$D$9>$D$8+366,$D$11<0),1,0))","v":0},"2026-01-01",{"$f":"IF(OR(ISERROR(DAY($D$8)),ISERROR(DAY($D$9))),\"WARNING: calculation not reliable due to incorrect start or end date; please correct!\",IF(D9<D8,\"WARNING: calculation not reliable due to incorrect start and end date (start date NOT before end date); please correct!\",IF(D9>D8+366,\" WARNING: calculation not reliable due to incorrect start and end date (period > 1 year), please correct!\",\"\")))","v":""}]
[null,"End date (including)",null,"2026-12-31",{"$f":"IF(Optimalisation!$T$53=11,\"REMARK: for this period a yearly booking is cheaper; please add 12th month to period for monthly cost estimate!\",IF(Optimalisation!$T$53=10,\"REMARK: for this period a yearly booking is cheaper; please add 11th and 12th month to period for monthly cost estimate!\",IF(Optimalisation!$T$53=9,\"REMARK: for this period a yearly booking is cheaper; please add 10th, 11th and 12th month to period for monthly cost estimate!\",\"\")))","v":""}]
[null,"Postage stamp point",null,"Exit non-storage","For all dates/periods, the prices used in the calculation tool are the total prices 2026 (see sheet 'Explanation')"]
[null,"Quantity ","kWh/h",{"v":100000,"d":"100,000"},{"$f":"IF(D11<0,\"WARNING: quantity is negative, please correct to positive value!\",\"\")","v":""}]
[]
[null,"PERIOD BOOKING CONVERTED INTO OPTIMISED COMBINATION OF Y, Q, M, DA CAPACITY PRODUCTS"]
[]
[null,"Month","Year","Yearly capacity booking","Quarterly capacity booking","Monthly capacity booking","Daily capacity \nbooking","Cost/month\nbased on 2026 tariffs"]
[{"$nulls":3},"kWh/h","kWh/h","kWh/h","kWh/h","EUR"]
[]
[{"$nulls":6},"Total cost:",{"$f":"SUM(H19:H42)","v":{"v":494149.82299999986,"d":"€ 494,150"}}]
[null,"January",{"$f":"IF($C$8=1,\"\",YEAR(D$8))","v":2026},{"$f":"IF($C$8=1,\"\",Optimalisation!Y29)","v":"Y"},{"$f":"IF($C$8=1,\"\",Optimalisation!Z29)","v":""},{"$f":"IF($C$8=1,\"\",Optimalisation!AA29)","v":""},{"$f":"IF($C$8=1,\"\",Optimalisation!AB29)","v":""},{"$f":"IF($C$8=1,\"\",Optimalisation!X29)","v":{"v":41968.88907671232,"d":"€ 41,969"}}]
[null,"February",{"$f":"IF($C$8=1,\"\",YEAR(D$8))","v":2026},{"$f":"IF($C$8=1,\"\",Optimalisation!Y30)","v":"Y"},{"$f":"IF($C$8=1,\"\",Optimalisation!Z30)","v":""},{"$f":"IF($C$8=1,\"\",Optimalisation!AA30)","v":""},{"$f":"IF($C$8=1,\"\",Optimalisation!AB30)","v":""},{"$f":"IF($C$8=1,\"\",Optimalisation!X30)","v":{"v":37907.38368219177,"d":"€ 37,907"}}]
[null,"March",2026,{"$f":"IF($C$8=1,\"\",Optimalisation!Y31)","v":"Y"},{"$f":"IF($C$8=1,\"\",Optimalisation!Z31)","v":""},{"$f":"IF($C$8=1,\"\",Optimalisation!AA31)","v":""},{"$f":"IF($C$8=1,\"\",Optimalisation!AB31)","v":""},{"$f":"IF($C$8=1,\"\",Optimalisation!X31)","v":{"v":41968.88907671232,"d":"€ 41,969"}}]
[null,"April",2026,{"$f":"IF($C$8=1,\"\",Optimalisation!Y32)","v":"Y"},{"$f":"IF($C$8=1,\"\",Optimalisation!Z32)","v":""},{"$f":"IF($C$8=1,\"\",Optimalisation!AA32)","v":""},{"$f":"IF($C$8=1,\"\",Optimalisation!AB32)","v":""},{"$f":"IF($C$8=1,\"\",Optimalisation!X32)","v":{"v":40615.05394520548,"d":"€ 40,615"}}]
[null,"May",2026,{"$f":"IF($C$8=1,\"\",Optimalisation!Y33)","v":"Y"},{"$f":"IF($C$8=1,\"\",Optimalisation!Z33)","v":""},{"$f":"IF($C$8=1,\"\",Optimalisation!AA33)","v":""},{"$f":"IF($C$8=1,\"\",Optimalisation!AB33)","v":""},{"$f":"IF($C$8=1,\"\",Optimalisation!X33)","v":{"v":41968.88907671232,"d":"€ 41,969"}}]
[null,"June",2026,{"$f":"IF($C$8=1,\"\",Optimalisation!Y34)","v":"Y"},{"$f":"IF($C$8=1,\"\",Optimalisation!Z34)","v":""},{"$f":"IF($C$8=1,\"\",Optimalisation!AA34)","v":""},{"$f":"IF($C$8=1,\"\",Optimalisation!AB34)","v":""},{"$f":"IF($C$8=1,\"\",Optimalisation!X34)","v":{"v":40615.05394520548,"d":"€ 40,615"}}]
[null,"July",2026,{"$f":"IF($C$8=1,\"\",Optimalisation!Y35)","v":"Y"},{"$f":"IF($C$8=1,\"\",Optimalisation!Z35)","v":""},{"$f":"IF($C$8=1,\"\",Optimalisation!AA35)","v":""},{"$f":"IF($C$8=1,\"\",Optimalisation!AB35)","v":""},{"$f":"IF($C$8=1,\"\",Optimalisation!X35)","v":{"v":41968.88907671232,"d":"€ 41,969"}}]
[null,"August",2026,{"$f":"IF($C$8=1,\"\",Optimalisation!Y36)","v":"Y"},{"$f":"IF($C$8=1,\"\",Optimalisation!Z36)","v":""},{"$f":"IF($C$8=1,\"\",Optimalisation!AA36)","v":""},{"$f":"IF($C$8=1,\"\",Optimalisation!AB36)","v":""},{"$f":"IF($C$8=1,\"\",Optimalisation!X36)","v":{"v":41968.88907671232,"d":"€ 41,969"}}]
[null,"September",2026,{"$f":"IF($C$8=1,\"\",Optimalisation!Y37)","v":"Y"},{"$f":"IF($C$8=1,\"\",Optimalisation!Z37)","v":""},{"$f":"IF($C$8=1,\"\",Optimalisation!AA37)","v":""},{"$f":"IF($C$8=1,\"\",Optimalisation!AB37)","v":""},{"$f":"IF($C$8=1,\"\",Optimalisation!X37)","v":{"v":40615.05394520548,"d":"€ 40,615"}}]
[null,"October",2026,{"$f":"IF($C$8=1,\"\",Optimalisation!Y38)","v":"Y"},{"$f":"IF($C$8=1,\"\",Optimalisation!Z38)","v":""},{"$f":"IF($C$8=1,\"\",Optimalisation!AA38)","v":""},{"$f":"IF($C$8=1,\"\",Optimalisation!AB38)","v":""},{"$f":"IF($C$8=1,\"\",Optimalisation!X38)","v":{"v":41968.88907671232,"d":"€ 41,969"}}]
[null,"November",2026,{"$f":"IF($C$8=1,\"\",Optimalisation!Y39)","v":"Y"},{"$f":"IF($C$8=1,\"\",Optimalisation!Z39)","v":""},{"$f":"IF($C$8=1,\"\",Optimalisation!AA39)","v":""},{"$f":"IF($C$8=1,\"\",Optimalisation!AB39)","v":""},{"$f":"IF($C$8=1,\"\",Optimalisation!X39)","v":{"v":40615.05394520548,"d":"€ 40,615"}}]
[null,"December",2026,{"$f":"IF($C$8=1,\"\",Optimalisation!Y40)","v":"Y"},{"$f":"IF($C$8=1,\"\",Optimalisation!Z40)","v":""},{"$f":"IF($C$8=1,\"\",Optimalisation!AA40)","v":""},{"$f":"IF($C$8=1,\"\",Optimalisation!AB40)","v":""},{"$f":"IF($C$8=1,\"\",Optimalisation!X40)","v":{"v":41968.88907671232,"d":"€ 41,969"}}]
[null,"January",{"$f":"IF($C$8=1,\"\",YEAR(D$8)+1)","v":2027},{"$f":"IF($C$8=1,\"\",Optimalisation!Y41)","v":""},{"$f":"IF($C$8=1,\"\",Optimalisation!Z41)","v":""},{"$f":"IF($C$8=1,\"\",Optimalisation!AA41)","v":""},{"$f":"IF($C$8=1,\"\",Optimalisation!AB41)","v":""},{"$f":"IF($C$8=1,\"\",Optimalisation!X41)","v":{"v":0,"d":"€ 0"}}]
[null,"February",{"$f":"IF($C$8=1,\"\",YEAR(D$8)+1)","v":2027},{"$f":"IF($C$8=1,\"\",Optimalisation!Y42)","v":""},{"$f":"IF($C$8=1,\"\",Optimalisation!Z42)","v":""},{"$f":"IF($C$8=1,\"\",Optimalisation!AA42)","v":""},{"$f":"IF($C$8=1,\"\",Optimalisation!AB42)","v":""},{"$f":"IF($C$8=1,\"\",Optimalisation!X42)","v":{"v":0,"d":"€ 0"}}]
[null,"March",2027,{"$f":"IF($C$8=1,\"\",Optimalisation!Y43)","v":""},{"$f":"IF($C$8=1,\"\",Optimalisation!Z43)","v":""},{"$f":"IF($C$8=1,\"\",Optimalisation!AA43)","v":""},{"$f":"IF($C$8=1,\"\",Optimalisation!AB43)","v":""},{"$f":"IF($C$8=1,\"\",Optimalisation!X43)","v":{"v":0,"d":"€ 0"}}]
[null,"April",2027,{"$f":"IF($C$8=1,\"\",Optimalisation!Y44)","v":""},{"$f":"IF($C$8=1,\"\",Optimalisation!Z44)","v":""},{"$f":"IF($C$8=1,\"\",Optimalisation!AA44)","v":""},{"$f":"IF($C$8=1,\"\",Optimalisation!AB44)","v":""},{"$f":"IF($C$8=1,\"\",Optimalisation!X44)","v":{"v":0,"d":"€ 0"}}]
[null,"May",2027,{"$f":"IF($C$8=1,\"\",Optimalisation!Y45)","v":""},{"$f":"IF($C$8=1,\"\",Optimalisation!Z45)","v":""},{"$f":"IF($C$8=1,\"\",Optimalisation!AA45)","v":""},{"$f":"IF($C$8=1,\"\",Optimalisation!AB45)","v":""},{"$f":"IF($C$8=1,\"\",Optimalisation!X45)","v":{"v":0,"d":"€ 0"}}]
[null,"June",2027,{"$f":"IF($C$8=1,\"\",Optimalisation!Y46)","v":""},{"$f":"IF($C$8=1,\"\",Optimalisation!Z46)","v":""},{"$f":"IF($C$8=1,\"\",Optimalisation!AA46)","v":""},{"$f":"IF($C$8=1,\"\",Optimalisation!AB46)","v":""},{"$f":"IF($C$8=1,\"\",Optimalisation!X46)","v":{"v":0,"d":"€ 0"}}]
[null,"July",2027,{"$f":"IF($C$8=1,\"\",Optimalisation!Y47)","v":""},{"$f":"IF($C$8=1,\"\",Optimalisation!Z47)","v":""},{"$f":"IF($C$8=1,\"\",Optimalisation!AA47)","v":""},{"$f":"IF($C$8=1,\"\",Optimalisation!AB47)","v":""},{"$f":"IF($C$8=1,\"\",Optimalisation!X47)","v":{"v":0,"d":"€ 0"}}]
[null,"August",2027,{"$f":"IF($C$8=1,\"\",Optimalisation!Y48)","v":""},{"$f":"IF($C$8=1,\"\",Optimalisation!Z48)","v":""},{"$f":"IF($C$8=1,\"\",Optimalisation!AA48)","v":""},{"$f":"IF($C$8=1,\"\",Optimalisation!AB48)","v":""},{"$f":"IF($C$8=1,\"\",Optimalisation!X48)","v":{"v":0,"d":"€ 0"}}]
[null,"September",2027,{"$f":"IF($C$8=1,\"\",Optimalisation!Y49)","v":""},{"$f":"IF($C$8=1,\"\",Optimalisation!Z49)","v":""},{"$f":"IF($C$8=1,\"\",Optimalisation!AA49)","v":""},{"$f":"IF($C$8=1,\"\",Optimalisation!AB49)","v":""},{"$f":"IF($C$8=1,\"\",Optimalisation!X49)","v":{"v":0,"d":"€ 0"}}]
[null,"October",2027,{"$f":"IF($C$8=1,\"\",Optimalisation!Y50)","v":""},{"$f":"IF($C$8=1,\"\",Optimalisation!Z50)","v":""},{"$f":"IF($C$8=1,\"\",Optimalisation!AA50)","v":""},{"$f":"IF($C$8=1,\"\",Optimalisation!AB50)","v":""},{"$f":"IF($C$8=1,\"\",Optimalisation!X50)","v":{"v":0,"d":"€ 0"}}]
[null,"November",2027,{"$f":"IF($C$8=1,\"\",Optimalisation!Y51)","v":""},{"$f":"IF($C$8=1,\"\",Optimalisation!Z51)","v":""},{"$f":"IF($C$8=1,\"\",Optimalisation!AA51)","v":""},{"$f":"IF($C$8=1,\"\",Optimalisation!AB51)","v":""},{"$f":"IF($C$8=1,\"\",Optimalisation!X51)","v":{"v":0,"d":"€ 0"}}]
[null,"December",2027,{"$f":"IF($C$8=1,\"\",Optimalisation!Y52)","v":""},{"$f":"IF($C$8=1,\"\",Optimalisation!Z52)","v":""},{"$f":"IF($C$8=1,\"\",Optimalisation!AA52)","v":""},{"$f":"IF($C$8=1,\"\",Optimalisation!AB52)","v":""},{"$f":"IF($C$8=1,\"\",Optimalisation!X52)","v":{"v":0,"d":"€ 0"}}]

{"sheet":"Total prices","index":2,"n_rows":42,"n_cols":19,"rows_kept":42,"merged":[[7,2,7,6],[7,8,7,12],[7,14,7,18],[12,2,23,2],[12,3,14,3],[12,8,23,8],[12,9,14,9],[12,14,23,14],[12,15,14,15],[15,3,17,3],[15,9,17,9],[15,15,17,15],[18,3,20,3],[18,9,20,9],[18,15,20,15],[21,3,23,3],[21,9,23,9],[21,15,23,15],[25,2,25,6],[25,8,25,12],[30,2,41,2],[30,3,32,3],[30,8,41,8],[30,9,32,9],[33,3,35,3],[33,9,35,9],[36,3,38,3],[36,9,38,9],[39,3,41,3],[39,9,41,9]]}
[]
[]
[]
[null,"TOTAL PRICES 2026 FIRM CAPACITY (which is sum of the all-in transmission tariffs and the neutrality charges)"]
[]
[]
[]
[null,"Total prices FIRM capacity for interconnection points","ENTRY REGULAR",{"$nulls":5},"ENTRY STORAGE",{"$nulls":5},"ENTRY LNG"]
[null,"Payable total prices FIRM capacity for domestic points"]
[null,null,"Year","Quarter","Month","Day","Within-day",null,"Year","Quarter","Month","Day","Within-day",null,"Year","Quarter","Month","Day","Within-day"]
[null,null,"EUR/kWh/h/Y","EUR/kWh/h/Q","EUR/kWh/h/M","EUR/kWh/h/DA","EUR/kWh/h/WID",null,"EUR/kWh/h/Y","EUR/kWh/h/Q","EUR/kWh/h/M","EUR/kWh/h/DA","EUR/kWh/h/WID",null,"EUR/kWh/h/Y","EUR/kWh/h/Q","EUR/kWh/h/M","EUR/kWh/h/DA","EUR/kWh/h/WID"]
[]
[null,"January",{"$f":"'Transmission tariffs'!C13+'Neutrality charge'!C13","v":5.76157135},{"$f":"'Transmission tariffs'!D13+'Neutrality charge'!D13","v":{"v":2.6317753,"d":"2.63177530"}},{"$f":"'Transmission tariffs'!E13+'Neutrality charge'!E13","v":1.25882442},{"$f":"'Transmission tariffs'!F13+'Neutrality charge'!F13","v":0.04897731},{"$f":"'Transmission tariffs'!G13+'Neutrality charge'!G13","v":0.00204073},null,{"$f":"'Transmission tariffs'!I13+'Neutrality charge'!I13","v":1.44039284},{"$f":"'Transmission tariffs'!J13+'Neutrality charge'!J13","v":{"v":0.6579438200000001,"d":"0.65794382"}},{"$f":"'Transmission tariffs'!K13+'Neutrality charge'!K13","v":{"v":0.31470610000000004,"d":"0.31470610"}},{"$f":"'Transmission tariffs'!L13+'Neutrality charge'!L13","v":0.01224432},{"$f":"'Transmission tariffs'!M13+'Neutrality charge'!M13","v":0.00051019},null,{"$f":"'Transmission tariffs'!O13+'Neutrality charge'!O13","v":4.60925708},{"$f":"'Transmission tariffs'!P13+'Neutrality charge'!P13","v":2.10542023},{"$f":"'Transmission tariffs'!Q13+'Neutrality charge'!Q13","v":1.00705953},{"$f":"'Transmission tariffs'!R13+'Neutrality charge'!R13","v":0.03918184},{"$f":"'Transmission tariffs'!S13+'Neutrality charge'!S13","v":{"v":1.63258E-3,"d":"0.00163258"}}]
[null,"February",null,null,{"$f":"'Transmission tariffs'!E14+'Neutrality charge'!E14","v":1.01634119},{"$f":"'Transmission tariffs'!F14+'Neutrality charge'!F14","v":{"v":0.043784,"d":"0.04378400"}},{"$f":"'Transmission tariffs'!G14+'Neutrality charge'!G14","v":{"v":1.8243399999999998E-3,"d":"0.00182434"}},{"$nulls":3},{"$f":"'Transmission tariffs'!K14+'Neutrality charge'!K14","v":{"v":0.25408529999999996,"d":"0.25408530"}},{"$f":"'Transmission tariffs'!L14+'Neutrality charge'!L14","v":{"v":0.010946,"d":"0.01094600"}},{"$f":"'Transmission tariffs'!M14+'Neutrality charge'!M14","v":{"v":0.0004561,"d":"0.00045610"}},{"$nulls":3},{"$f":"'Transmission tariffs'!Q14+'Neutrality charge'!Q14","v":0.81307295},{"$f":"'Transmission tariffs'!R14+'Neutrality charge'!R14","v":0.03502719},{"$f":"'Transmission tariffs'!S14+'Neutrality charge'!S14","v":{"v":1.45948E-3,"d":"0.00145948"}}]
[null,"March",null,null,{"$f":"'Transmission tariffs'!E15+'Neutrality charge'!E15","v":0.88007607},{"$f":"'Transmission tariffs'!F15+'Neutrality charge'!F15","v":{"v":0.034226099999999995,"d":"0.03422610"}},{"$f":"'Transmission tariffs'!G15+'Neutrality charge'!G15","v":{"v":1.4261E-3,"d":"0.00142610"}},{"$nulls":3},{"$f":"'Transmission tariffs'!K15+'Neutrality charge'!K15","v":{"v":0.22001901999999998,"d":"0.22001902"}},{"$f":"'Transmission tariffs'!L15+'Neutrality charge'!L15","v":0.00855653},{"$f":"'Transmission tariffs'!M15+'Neutrality charge'!M15","v":0.00035653},{"$nulls":3},{"$f":"'Transmission tariffs'!Q15+'Neutrality charge'!Q15","v":0.70406086},{"$f":"'Transmission tariffs'!R15+'Neutrality charge'!R15","v":0.02738088},{"$f":"'Transmission tariffs'!S15+'Neutrality charge'!S15","v":0.00114088}]
[null,"April",null,{"$f":"'Transmission tariffs'!D16+'Neutrality charge'!D16","v":1.40771762},{"$f":"'Transmission tariffs'!E16+'Neutrality charge'!E16","v":0.63503566},{"$f":"'Transmission tariffs'!F16+'Neutrality charge'!F16","v":0.02552455},{"$f":"'Transmission tariffs'!G16+'Neutrality charge'!G16","v":{"v":1.06353E-3,"d":"0.00106353"}},null,null,{"$f":"'Transmission tariffs'!J16+'Neutrality charge'!J16","v":{"v":0.3519294,"d":"0.35192940"}},{"$f":"'Transmission tariffs'!K16+'Neutrality charge'!K16","v":0.15875892},{"$f":"'Transmission tariffs'!L16+'Neutrality charge'!L16","v":{"v":6.3811399999999996E-3,"d":"0.00638114"}},{"$f":"'Transmission tariffs'!M16+'Neutrality charge'!M16","v":0.00026589},null,null,{"$f":"'Transmission tariffs'!P16+'Neutrality charge'!P16","v":{"v":1.1261741,"d":"1.12617410"}},{"$f":"'Transmission tariffs'!Q16+'Neutrality charge'!Q16","v":{"v":0.5080285299999999,"d":"0.50802853"}},{"$f":"'Transmission tariffs'!R16+'Neutrality charge'!R16","v":0.02041964},{"$f":"'Transmission tariffs'!S16+'Neutrality charge'!S16","v":0.00085082}]
[null,"May",null,null,{"$f":"'Transmission tariffs'!E17+'Neutrality charge'!E17","v":{"v":0.5813346500000001,"d":"0.58133465"}},{"$f":"'Transmission tariffs'!F17+'Neutrality charge'!F17","v":0.02262403},{"$f":"'Transmission tariffs'!G17+'Neutrality charge'!G17","v":0.00094268},{"$nulls":3},{"$f":"'Transmission tariffs'!K17+'Neutrality charge'!K17","v":0.14533366},{"$f":"'Transmission tariffs'!L17+'Neutrality charge'!L17","v":0.00565601},{"$f":"'Transmission tariffs'!M17+'Neutrality charge'!M17","v":{"v":2.3567E-4,"d":"0.00023567"}},{"$nulls":3},{"$f":"'Transmission tariffs'!Q17+'Neutrality charge'!Q17","v":0.46506773},{"$f":"'Transmission tariffs'!R17+'Neutrality charge'!R17","v":0.01809922},{"$f":"'Transmission tariffs'!S17+'Neutrality charge'!S17","v":0.00075415}]
[null,"June",null,null,{"$f":"'Transmission tariffs'!E18+'Neutrality charge'!E18","v":0.47236992},{"$f":"'Transmission tariffs'!F18+'Neutrality charge'!F18","v":{"v":0.019005300000000003,"d":"0.01900530"}},{"$f":"'Transmission tariffs'!G18+'Neutrality charge'!G18","v":{"v":7.919E-4,"d":"0.00079190"}},{"$nulls":3},{"$f":"'Transmission tariffs'!K18+'Neutrality charge'!K18","v":0.11809249},{"$f":"'Transmission tariffs'!L18+'Neutrality charge'!L18","v":{"v":0.004751320000000001,"d":"0.00475132"}},{"$f":"'Transmission tariffs'!M18+'Neutrality charge'!M18","v":{"v":1.9798E-4,"d":"0.00019798"}},{"$nulls":3},{"$f":"'Transmission tariffs'!Q18+'Neutrality charge'!Q18","v":0.37789594},{"$f":"'Transmission tariffs'!R18+'Neutrality charge'!R18","v":0.01520423},{"$f":"'Transmission tariffs'!S18+'Neutrality charge'!S18","v":0.00063352}]
[null,"July",null,{"$f":"'Transmission tariffs'!D19+'Neutrality charge'!D19","v":1.14181716},{"$f":"'Transmission tariffs'!E19+'Neutrality charge'!E19","v":0.46095728},{"$f":"'Transmission tariffs'!F19+'Neutrality charge'!F19","v":0.01792795},{"$f":"'Transmission tariffs'!G19+'Neutrality charge'!G19","v":{"v":7.470100000000001E-4,"d":"0.00074701"}},null,null,{"$f":"'Transmission tariffs'!J19+'Neutrality charge'!J19","v":0.28545429},{"$f":"'Transmission tariffs'!K19+'Neutrality charge'!K19","v":{"v":0.11523931999999999,"d":"0.11523932"}},{"$f":"'Transmission tariffs'!L19+'Neutrality charge'!L19","v":0.00448199},{"$f":"'Transmission tariffs'!M19+'Neutrality charge'!M19","v":{"v":1.8675999999999998E-4,"d":"0.00018676"}},null,null,{"$f":"'Transmission tariffs'!P19+'Neutrality charge'!P19","v":{"v":0.9134537300000001,"d":"0.91345373"}},{"$f":"'Transmission tariffs'!Q19+'Neutrality charge'!Q19","v":{"v":0.36876581999999997,"d":"0.36876582"}},{"$f":"'Transmission tariffs'!R19+'Neutrality charge'!R19","v":0.01434237},{"$f":"'Transmission tariffs'!S19+'Neutrality charge'!S19","v":{"v":5.9761000000000015E-4,"d":"0.00059761"}}]
[null,"August",null,null,{"$f":"'Transmission tariffs'!E20+'Neutrality charge'!E20","v":0.43820302},{"$f":"'Transmission tariffs'!F20+'Neutrality charge'!F20","v":0.01707161},{"$f":"'Transmission tariffs'!G20+'Neutrality charge'!G20","v":0.00071133},{"$nulls":3},{"$f":"'Transmission tariffs'!K20+'Neutrality charge'!K20","v":0.10955075},{"$f":"'Transmission tariffs'!L20+'Neutrality charge'!L20","v":0.00426791},{"$f":"'Transmission tariffs'!M20+'Neutrality charge'!M20","v":0.00017784},{"$nulls":3},{"$f":"'Transmission tariffs'!Q20+'Neutrality charge'!Q20","v":0.35056242},{"$f":"'Transmission tariffs'!R20+'Neutrality charge'!R20","v":0.01365729},{"$f":"'Transmission tariffs'!S20+'Neutrality charge'!S20","v":{"v":5.6907000000000008E-4,"d":"0.00056907"}}]
[null,"September",null,null,{"$f":"'Transmission tariffs'!E21+'Neutrality charge'!E21","v":0.47094927},{"$f":"'Transmission tariffs'!F21+'Neutrality charge'!F21","v":0.01895004},{"$f":"'Transmission tariffs'!G21+'Neutrality charge'!G21","v":{"v":7.896E-4,"d":"0.00078960"}},{"$nulls":3},{"$f":"'Transmission tariffs'!K21+'Neutrality charge'!K21","v":0.11773731},{"$f":"'Transmission tariffs'!L21+'Neutrality charge'!L21","v":0.00473751},{"$f":"'Transmission tariffs'!M21+'Neutrality charge'!M21","v":{"v":1.9741E-4,"d":"0.00019741"}},{"$nulls":3},{"$f":"'Transmission tariffs'!Q21+'Neutrality charge'!Q21","v":0.37675941},{"$f":"'Transmission tariffs'!R21+'Neutrality charge'!R21","v":0.01516004},{"$f":"'Transmission tariffs'!S21+'Neutrality charge'!S21","v":0.00063168}]
[null,"October",null,{"$f":"'Transmission tariffs'!D22+'Neutrality charge'!D22","v":2.00589501},{"$f":"'Transmission tariffs'!E22+'Neutrality charge'!E22","v":{"v":0.5585804,"d":"0.55858040"}},{"$f":"'Transmission tariffs'!F22+'Neutrality charge'!F22","v":{"v":0.021740060000000002,"d":"0.02174006"}},{"$f":"'Transmission tariffs'!G22+'Neutrality charge'!G22","v":0.00090585},null,null,{"$f":"'Transmission tariffs'!J22+'Neutrality charge'!J22","v":0.50147375},{"$f":"'Transmission tariffs'!K22+'Neutrality charge'!K22","v":{"v":0.1396451,"d":"0.13964510"}},{"$f":"'Transmission tariffs'!L22+'Neutrality charge'!L22","v":0.00543502},{"$f":"'Transmission tariffs'!M22+'Neutrality charge'!M22","v":0.00022647},null,null,{"$f":"'Transmission tariffs'!P22+'Neutrality charge'!P22","v":1.60471601},{"$f":"'Transmission tariffs'!Q22+'Neutrality charge'!Q22","v":{"v":0.44686431000000004,"d":"0.44686431"}},{"$f":"'Transmission tariffs'!R22+'Neutrality charge'!R22","v":{"v":0.017392059999999997,"d":"0.01739206"}},{"$f":"'Transmission tariffs'!S22+'Neutrality charge'!S22","v":0.00072468}]
[null,"November",null,null,{"$f":"'Transmission tariffs'!E23+'Neutrality charge'!E23","v":{"v":0.8026736999999999,"d":"0.80267370"}},{"$f":"'Transmission tariffs'!F23+'Neutrality charge'!F23","v":{"v":0.0322648,"d":"0.03226480"}},{"$f":"'Transmission tariffs'!G23+'Neutrality charge'!G23","v":0.00134437},{"$nulls":3},{"$f":"'Transmission tariffs'!K23+'Neutrality charge'!K23","v":{"v":0.20066842000000001,"d":"0.20066842"}},{"$f":"'Transmission tariffs'!L23+'Neutrality charge'!L23","v":{"v":0.008066199999999999,"d":"0.00806620"}},{"$f":"'Transmission tariffs'!M23+'Neutrality charge'!M23","v":{"v":0.0003361,"d":"0.00033610"}},{"$nulls":3},{"$f":"'Transmission tariffs'!Q23+'Neutrality charge'!Q23","v":0.64213897},{"$f":"'Transmission tariffs'!R23+'Neutrality charge'!R23","v":0.02581184},{"$f":"'Transmission tariffs'!S23+'Neutrality charge'!S23","v":{"v":1.0754999999999999E-3,"d":"0.00107550"}}]
[null,"December",null,null,{"$f":"'Transmission tariffs'!E24+'Neutrality charge'!E24","v":1.04522797},{"$f":"'Transmission tariffs'!F24+'Neutrality charge'!F24","v":0.04066249},{"$f":"'Transmission tariffs'!G24+'Neutrality charge'!G24","v":{"v":1.69428E-3,"d":"0.00169428"}},{"$nulls":3},{"$f":"'Transmission tariffs'!K24+'Neutrality charge'!K24","v":0.26130699},{"$f":"'Transmission tariffs'!L24+'Neutrality charge'!L24","v":0.01016562},{"$f":"'Transmission tariffs'!M24+'Neutrality charge'!M24","v":{"v":4.2357999999999995E-4,"d":"0.00042358"}},{"$nulls":3},{"$f":"'Transmission tariffs'!Q24+'Neutrality charge'!Q24","v":0.83618238},{"$f":"'Transmission tariffs'!R24+'Neutrality charge'!R24","v":{"v":0.032529989999999995,"d":"0.03252999"}},{"$f":"'Transmission tariffs'!S24+'Neutrality charge'!S24","v":{"v":1.3554199999999998E-3,"d":"0.00135542"}}]
[]
[null,"Total prices FIRM capacity for interconnection points","EXIT NON-STORAGE",{"$nulls":5},"EXIT STORAGE"]
[null,"Payable total prices FIRM capacity for domestic points"]
[null,null,"Year","Quarter","Month","Day","Within-day",null,"Year","Quarter","Month","Day","Within-day"]
[null,null,"EUR/kWh/h/Y","EUR/kWh/h/Q","EUR/kWh/h/M","EUR/kWh/h/DA","EUR/kWh/h/WID",null,"EUR/kWh/h/Y","EUR/kWh/h/Q","EUR/kWh/h/M","EUR/kWh/h/DA","EUR/kWh/h/WID"]
[]
[null,"January",{"$f":"'Transmission tariffs'!C31+'Neutrality charge'!C31","v":4.94149823},{"$f":"'Transmission tariffs'!D31+'Neutrality charge'!D31","v":2.25718162},{"$f":"'Transmission tariffs'!E31+'Neutrality charge'!E31","v":1.07964967},{"$f":"'Transmission tariffs'!F31+'Neutrality charge'!F31","v":0.04200612},{"$f":"'Transmission tariffs'!G31+'Neutrality charge'!G31","v":{"v":1.7502599999999998E-3,"d":"0.00175026"}},null,{"$f":"'Transmission tariffs'!I31+'Neutrality charge'!I31","v":1.23537456},{"$f":"'Transmission tariffs'!J31+'Neutrality charge'!J31","v":{"v":0.5642954099999999,"d":"0.56429541"}},{"$f":"'Transmission tariffs'!K31+'Neutrality charge'!K31","v":0.26991242},{"$f":"'Transmission tariffs'!L31+'Neutrality charge'!L31","v":0.01050153},{"$f":"'Transmission tariffs'!M31+'Neutrality charge'!M31","v":{"v":4.3756999999999997E-4,"d":"0.00043757"}}]
[null,"February",null,null,{"$f":"'Transmission tariffs'!E32+'Neutrality charge'!E32","v":0.87168029},{"$f":"'Transmission tariffs'!F32+'Neutrality charge'!F32","v":{"v":0.037552,"d":"0.03755200"}},{"$f":"'Transmission tariffs'!G32+'Neutrality charge'!G32","v":0.00156468},{"$nulls":3},{"$f":"'Transmission tariffs'!K32+'Neutrality charge'!K32","v":0.21792008},{"$f":"'Transmission tariffs'!L32+'Neutrality charge'!L32","v":{"v":0.009388009999999999,"d":"0.00938801"}},{"$f":"'Transmission tariffs'!M32+'Neutrality charge'!M32","v":0.00039117}]
[null,"March",null,null,{"$f":"'Transmission tariffs'!E33+'Neutrality charge'!E33","v":0.75481047},{"$f":"'Transmission tariffs'!F33+'Neutrality charge'!F33","v":0.02935453},{"$f":"'Transmission tariffs'!G33+'Neutrality charge'!G33","v":0.00122312},{"$nulls":3},{"$f":"'Transmission tariffs'!K33+'Neutrality charge'!K33","v":0.18870261},{"$f":"'Transmission tariffs'!L33+'Neutrality charge'!L33","v":0.00733864},{"$f":"'Transmission tariffs'!M33+'Neutrality charge'!M33","v":0.00030579}]
[null,"April",null,{"$f":"'Transmission tariffs'!D34+'Neutrality charge'!D34","v":1.20735017},{"$f":"'Transmission tariffs'!E34+'Neutrality charge'!E34","v":0.54464787},{"$f":"'Transmission tariffs'!F34+'Neutrality charge'!F34","v":{"v":0.021891519999999998,"d":"0.02189152"}},{"$f":"'Transmission tariffs'!G34+'Neutrality charge'!G34","v":0.00091216},null,null,{"$f":"'Transmission tariffs'!J34+'Neutrality charge'!J34","v":0.30183754},{"$f":"'Transmission tariffs'!K34+'Neutrality charge'!K34","v":0.13616196},{"$f":"'Transmission tariffs'!L34+'Neutrality charge'!L34","v":{"v":0.005472879999999999,"d":"0.00547288"}},{"$f":"'Transmission tariffs'!M34+'Neutrality charge'!M34","v":0.00022805}]
[null,"May",null,null,{"$f":"'Transmission tariffs'!E35+'Neutrality charge'!E35","v":{"v":0.4985904,"d":"0.49859040"}},{"$f":"'Transmission tariffs'!F35+'Neutrality charge'!F35","v":0.01940385},{"$f":"'Transmission tariffs'!G35+'Neutrality charge'!G35","v":0.00080851},{"$nulls":3},{"$f":"'Transmission tariffs'!K35+'Neutrality charge'!K35","v":{"v":0.1246476,"d":"0.12464760"}},{"$f":"'Transmission tariffs'!L35+'Neutrality charge'!L35","v":0.00485096},{"$f":"'Transmission tariffs'!M35+'Neutrality charge'!M35","v":{"v":2.0213999999999999E-4,"d":"0.00020214"}}]
[null,"June",null,null,{"$f":"'Transmission tariffs'!E36+'Neutrality charge'!E36","v":0.40513516},{"$f":"'Transmission tariffs'!F36+'Neutrality charge'!F36","v":{"v":0.016300170000000003,"d":"0.01630017"}},{"$f":"'Transmission tariffs'!G36+'Neutrality charge'!G36","v":0.00067918},{"$nulls":3},{"$f":"'Transmission tariffs'!K36+'Neutrality charge'!K36","v":0.10128379},{"$f":"'Transmission tariffs'!L36+'Neutrality charge'!L36","v":0.00407504},{"$f":"'Transmission tariffs'!M36+'Neutrality charge'!M36","v":{"v":0.0001698,"d":"0.00016980"}}]
[null,"July",null,{"$f":"'Transmission tariffs'!D37+'Neutrality charge'!D37","v":{"v":0.9792966399999999,"d":"0.97929664"}},{"$f":"'Transmission tariffs'!E37+'Neutrality charge'!E37","v":0.39534693},{"$f":"'Transmission tariffs'!F37+'Neutrality charge'!F37","v":0.01537618},{"$f":"'Transmission tariffs'!G37+'Neutrality charge'!G37","v":{"v":6.4069000000000007E-4,"d":"0.00064069"}},null,null,{"$f":"'Transmission tariffs'!J37+'Neutrality charge'!J37","v":0.24482416},{"$f":"'Transmission tariffs'!K37+'Neutrality charge'!K37","v":0.09883674},{"$f":"'Transmission tariffs'!L37+'Neutrality charge'!L37","v":{"v":3.84404E-3,"d":"0.00384404"}},{"$f":"'Transmission tariffs'!M37+'Neutrality charge'!M37","v":{"v":1.6018E-4,"d":"0.00016018"}}]
[null,"August",null,null,{"$f":"'Transmission tariffs'!E38+'Neutrality charge'!E38","v":{"v":0.3758314,"d":"0.37583140"}},{"$f":"'Transmission tariffs'!F38+'Neutrality charge'!F38","v":{"v":0.014641719999999999,"d":"0.01464172"}},{"$f":"'Transmission tariffs'!G38+'Neutrality charge'!G38","v":0.00061008},{"$nulls":3},{"$f":"'Transmission tariffs'!K38+'Neutrality charge'!K38","v":0.09395785},{"$f":"'Transmission tariffs'!L38+'Neutrality charge'!L38","v":{"v":3.6604299999999997E-3,"d":"0.00366043"}},{"$f":"'Transmission tariffs'!M38+'Neutrality charge'!M38","v":{"v":1.5253E-4,"d":"0.00015253"}}]
[null,"September",null,null,{"$f":"'Transmission tariffs'!E39+'Neutrality charge'!E39","v":0.40391671},{"$f":"'Transmission tariffs'!F39+'Neutrality charge'!F39","v":{"v":0.0162528,"d":"0.01625280"}},{"$f":"'Transmission tariffs'!G39+'Neutrality charge'!G39","v":{"v":6.7721000000000014E-4,"d":"0.00067721"}},{"$nulls":3},{"$f":"'Transmission tariffs'!K39+'Neutrality charge'!K39","v":0.10097918},{"$f":"'Transmission tariffs'!L39+'Neutrality charge'!L39","v":0.00406319},{"$f":"'Transmission tariffs'!M39+'Neutrality charge'!M39","v":0.00016931}]
[null,"October",null,{"$f":"'Transmission tariffs'!D40+'Neutrality charge'!D40","v":1.72038599},{"$f":"'Transmission tariffs'!E40+'Neutrality charge'!E40","v":0.47907487},{"$f":"'Transmission tariffs'!F40+'Neutrality charge'!F40","v":{"v":0.0186457,"d":"0.01864570"}},{"$f":"'Transmission tariffs'!G40+'Neutrality charge'!G40","v":{"v":7.7692000000000006E-4,"d":"0.00077692"}},null,null,{"$f":"'Transmission tariffs'!J40+'Neutrality charge'!J40","v":{"v":0.4300965,"d":"0.43009650"}},{"$f":"'Transmission tariffs'!K40+'Neutrality charge'!K40","v":0.11976871},{"$f":"'Transmission tariffs'!L40+'Neutrality charge'!L40","v":0.00466142},{"$f":"'Transmission tariffs'!M40+'Neutrality charge'!M40","v":{"v":1.9423000000000002E-4,"d":"0.00019423"}}]
[null,"November",null,null,{"$f":"'Transmission tariffs'!E41+'Neutrality charge'!E41","v":0.68842517},{"$f":"'Transmission tariffs'!F41+'Neutrality charge'!F41","v":{"v":0.027672389999999998,"d":"0.02767239"}},{"$f":"'Transmission tariffs'!G41+'Neutrality charge'!G41","v":{"v":1.15303E-3,"d":"0.00115303"}},{"$nulls":3},{"$f":"'Transmission tariffs'!K41+'Neutrality charge'!K41","v":0.17210629},{"$f":"'Transmission tariffs'!L41+'Neutrality charge'!L41","v":{"v":0.0069181,"d":"0.00691810"}},{"$f":"'Transmission tariffs'!M41+'Neutrality charge'!M41","v":{"v":2.8827000000000003E-4,"d":"0.00028827"}}]
[null,"December",null,null,{"$f":"'Transmission tariffs'!E42+'Neutrality charge'!E42","v":0.89645547},{"$f":"'Transmission tariffs'!F42+'Neutrality charge'!F42","v":0.03487479},{"$f":"'Transmission tariffs'!G42+'Neutrality charge'!G42","v":{"v":1.45313E-3,"d":"0.00145313"}},{"$nulls":3},{"$f":"'Transmission tariffs'!K42+'Neutrality charge'!K42","v":0.22411387},{"$f":"'Transmission tariffs'!L42+'Neutrality charge'!L42","v":{"v":0.008718700000000001,"d":"0.00871870"}},{"$f":"'Transmission tariffs'!M42+'Neutrality charge'!M42","v":{"v":3.6329E-4,"d":"0.00036329"}}]

{"sheet":"Transmission tariffs","index":3,"n_rows":42,"n_cols":19,"rows_kept":42,"merged":[[7,2,7,6],[7,8,7,12],[7,14,7,18],[12,2,23,2],[12,3,14,3],[12,8,23,8],[12,9,14,9],[12,14,23,14],[12,15,14,15],[15,3,17,3],[15,9,17,9],[15,15,17,15],[18,3,20,3],[18,9,20,9],[18,15,20,15],[21,3,23,3],[21,9,23,9],[21,15,23,15],[25,2,25,6],[25,8,25,12],[30,2,41,2],[30,3,32,3],[30,8,41,8],[30,9,32,9],[33,3,35,3],[33,9,35,9],[36,3,38,3],[36,9,38,9],[39,3,41,3],[39,9,41,9]]}
[]
[]
[]
[null,"ALL-IN TRANSMISSION TARIFFS 2026 (as established by the Dutch regulator ACM)"]
[]
[null,"Tariffs are all rounded to 8 decimals. Within-day prices are rounded up. "]
[]
[null,"Reserve prices FIRM capacity for interconnection points","ENTRY REGULAR",{"$nulls":5},"ENTRY STORAGE",{"$nulls":5},"ENTRY LNG"]
[null,"Payable prices FIRM capacity for domestic points"]
[null,null,"Year","Quarter","Month","Day","Within-day",null,"Year","Quarter","Month","Day","Within-day",null,"Year","Quarter","Month","Day","Within-day"]
[null,null,"EUR/kWh/h/Y","EUR/kWh/h/Q","EUR/kWh/h/M","EUR/kWh/h/DA","EUR/kWh/h/WID",null,"EUR/kWh/h/Y","EUR/kWh/h/Q","EUR/kWh/h/M","EUR/kWh/h/DA","EUR/kWh/h/WID",null,"EUR/kWh/h/Y","EUR/kWh/h/Q","EUR/kWh/h/M","EUR/kWh/h/DA","EUR/kWh/h/WID"]
[]
[null,"Januari",5.71417681,2.61012638,1.24846936,0.04857442,0.00202394,null,{"v":1.4285442,"d":"1.42854420"},0.65253159,0.31211734,{"v":0.0121436,"d":"0.01214360"},{"v":5.0599E-4,"d":"0.00050599"},null,4.57134145,{"v":2.0881011,"d":"2.08810110"},0.99877548,0.03885953,{"v":1.61915E-3,"d":"0.00161915"}]
[null,"Februari",{"v":0,"d":"0.00000000"},{"v":0,"d":"0.00000000"},1.00798079,0.04342383,{"v":1.8093299999999998E-3,"d":"0.00180933"},null,{"v":0,"d":"0.00000000"},{"v":0,"d":"0.00000000"},{"v":0.2519952,"d":"0.25199520"},0.01085596,{"v":4.5233999999999997E-4,"d":"0.00045234"},null,{"v":0,"d":"0.00000000"},{"v":0,"d":"0.00000000"},0.80638463,0.03473906,{"v":1.44747E-3,"d":"0.00144747"}]
[null,"Maart",{"v":0,"d":"0.00000000"},{"v":0,"d":"0.00000000"},0.87283659,0.03394456,0.00141436,null,{"v":0,"d":"0.00000000"},{"v":0,"d":"0.00000000"},0.21820915,0.00848614,0.00035359,null,{"v":0,"d":"0.00000000"},{"v":0,"d":"0.00000000"},0.69826927,0.02715565,{"v":1.13149E-3,"d":"0.00113149"}]
[null,"April",{"v":0,"d":"0.00000000"},1.39613777,0.62981187,0.02531459,{"v":1.05478E-3,"d":"0.00105478"},null,{"v":0,"d":"0.00000000"},0.34903444,0.15745297,0.00632865,{"v":0.0002637,"d":"0.00026370"},null,{"v":0,"d":"0.00000000"},1.11691022,{"v":0.5038495,"d":"0.50384950"},0.02025167,0.00084382]
[null,"Mei",{"v":0,"d":"0.00000000"},{"v":0,"d":"0.00000000"},0.57655261,0.02243793,{"v":9.3492E-4,"d":"0.00093492"},null,{"v":0,"d":"0.00000000"},{"v":0,"d":"0.00000000"},0.14413815,{"v":5.60948E-3,"d":"0.00560948"},{"v":2.3373E-4,"d":"0.00023373"},null,{"v":0,"d":"0.00000000"},{"v":0,"d":"0.00000000"},0.46124209,0.01795034,{"v":7.4794E-4,"d":"0.00074794"}]
[null,"Juni",{"v":0,"d":"0.00000000"},{"v":0,"d":"0.00000000"},0.46848422,0.01884896,0.00078538,null,{"v":0,"d":"0.00000000"},{"v":0,"d":"0.00000000"},0.11712106,0.00471224,{"v":1.9635E-4,"d":"0.00019635"},null,{"v":0,"d":"0.00000000"},{"v":0,"d":"0.00000000"},0.37478738,0.01507916,{"v":0.0006283,"d":"0.00062830"}]
[null,"Juli",{"v":0,"d":"0.00000000"},{"v":1.1324246,"d":"1.13242460"},0.45716546,0.01778048,{"v":7.4086000000000009E-4,"d":"0.00074086"},null,{"v":0,"d":"0.00000000"},0.28310615,0.11429136,0.00444512,0.00018522,null,{"v":0,"d":"0.00000000"},0.90593968,0.36573236,0.01422439,{"v":5.926900000000001E-4,"d":"0.00059269"}]
[null,"Augustus",{"v":0,"d":"0.00000000"},{"v":0,"d":"0.00000000"},0.43459837,0.01693118,0.00070547,null,{"v":0,"d":"0.00000000"},{"v":0,"d":"0.00000000"},0.10864959,{"v":0.0042328,"d":"0.00423280"},0.00017637,null,{"v":0,"d":"0.00000000"},{"v":0,"d":"0.00000000"},{"v":0.3476787,"d":"0.34767870"},0.01354495,{"v":5.6438000000000007E-4,"d":"0.00056438"}]
[null,"September",{"v":0,"d":"0.00000000"},{"v":0,"d":"0.00000000"},0.46707525,0.01879416,{"v":0.0007831,"d":"0.00078310"},null,{"v":0,"d":"0.00000000"},{"v":0,"d":"0.00000000"},0.11676881,0.00469854,{"v":1.9578E-4,"d":"0.00019578"},null,{"v":0,"d":"0.00000000"},{"v":0,"d":"0.00000000"},{"v":0.3736602,"d":"0.37366020"},0.01503533,0.00062648]
[null,"Oktober",{"v":0,"d":"0.00000000"},1.98939457,0.55398553,0.02156123,{"v":8.9839E-4,"d":"0.00089839"},null,{"v":0,"d":"0.00000000"},0.49734864,0.13849638,0.00539031,{"v":2.2459999999999998E-4,"d":"0.00022460"},null,{"v":0,"d":"0.00000000"},1.59151566,0.44318842,0.01724899,0.00071871]
[null,"November",{"v":0,"d":"0.00000000"},{"v":0,"d":"0.00000000"},0.79607093,0.03199939,{"v":1.3333099999999999E-3,"d":"0.00133331"},null,{"v":0,"d":"0.00000000"},{"v":0,"d":"0.00000000"},0.19901773,0.00799985,0.00033333,null,{"v":0,"d":"0.00000000"},{"v":0,"d":"0.00000000"},0.63685675,0.02559951,0.00106665]
[null,"December",{"v":0,"d":"0.00000000"},{"v":0,"d":"0.00000000"},1.03662995,{"v":0.040328,"d":"0.04032800"},{"v":1.68034E-3,"d":"0.00168034"},null,{"v":0,"d":"0.00000000"},{"v":0,"d":"0.00000000"},0.25915749,{"v":0.010082,"d":"0.01008200"},{"v":4.2008999999999997E-4,"d":"0.00042009"},null,{"v":0,"d":"0.00000000"},{"v":0,"d":"0.00000000"},0.82930396,{"v":0.0322624,"d":"0.03226240"},{"v":1.3442699999999998E-3,"d":"0.00134427"}]
[]
[null,"Reserve prices FIRM capacity for interconnection points","EXIT NON-STORAGE",{"$nulls":5},"EXIT STORAGE"]
[null,"Payable prices FIRM capacity for domestic points"]
[null,null,"Year","Quarter","Month","Day","Within-day",null,"Year","Quarter","Month","Day","Within-day"]
[null,null,"EUR/kWh/h/Y","EUR/kWh/h/Q","EUR/kWh/h/M","EUR/kWh/h/DA","EUR/kWh/h/WID",null,"EUR/kWh/h/Y","EUR/kWh/h/Q","EUR/kWh/h/M","EUR/kWh/h/DA","EUR/kWh/h/WID"]
[]
[null,"Januari",4.90084959,{"v":2.2386141,"d":"2.23861410"},{"v":1.0707685,"d":"1.07076850"},0.04166058,{"v":1.7358599999999999E-3,"d":"0.00173586"},null,{"v":1.2252124,"d":"1.22521240"},0.55965353,0.26769213,0.01041514,0.00043397]
[null,"Februari",{"v":0,"d":"0.00000000"},{"v":0,"d":"0.00000000"},0.86450987,{"v":0.0372431,"d":"0.03724310"},{"v":1.5517999999999999E-3,"d":"0.00155180"},null,{"v":0,"d":"0.00000000"},{"v":0,"d":"0.00000000"},0.21612747,0.00931078,{"v":3.8794999999999997E-4,"d":"0.00038795"}]
[null,"Maart",{"v":0,"d":"0.00000000"},{"v":0,"d":"0.00000000"},0.74860142,0.02911306,{"v":1.21305E-3,"d":"0.00121305"},null,{"v":0,"d":"0.00000000"},{"v":0,"d":"0.00000000"},0.18715035,0.00727827,0.00030327]
[null,"April",{"v":0,"d":"0.00000000"},1.19741854,0.54016761,0.02171144,0.00090465,null,{"v":0,"d":"0.00000000"},0.29935463,{"v":0.1350419,"d":"0.13504190"},0.00542786,{"v":2.2616999999999998E-4,"d":"0.00022617"}]
[null,"Mei",{"v":0,"d":"0.00000000"},{"v":0,"d":"0.00000000"},0.49448901,0.01924423,{"v":8.0185E-4,"d":"0.00080185"},null,{"v":0,"d":"0.00000000"},{"v":0,"d":"0.00000000"},0.12362225,0.00481106,{"v":2.0046999999999998E-4,"d":"0.00020047"}]
[null,"Juni",{"v":0,"d":"0.00000000"},{"v":0,"d":"0.00000000"},0.40180253,0.01616609,{"v":6.7359000000000006E-4,"d":"0.00067359"},null,{"v":0,"d":"0.00000000"},{"v":0,"d":"0.00000000"},0.10045063,0.00404152,{"v":1.684E-4,"d":"0.00016840"}]
[null,"Juli",{"v":0,"d":"0.00000000"},0.97124097,0.39209482,{"v":0.0152497,"d":"0.01524970"},{"v":6.354100000000001E-4,"d":"0.00063541"},null,{"v":0,"d":"0.00000000"},0.24281024,0.09802371,{"v":3.81242E-3,"d":"0.00381242"},0.00015886]
[null,"Augustus",{"v":0,"d":"0.00000000"},{"v":0,"d":"0.00000000"},0.37273982,0.01452128,0.00060506,null,{"v":0,"d":"0.00000000"},{"v":0,"d":"0.00000000"},0.09318496,0.00363032,0.00015127]
[null,"September",{"v":0,"d":"0.00000000"},{"v":0,"d":"0.00000000"},{"v":0.4005941,"d":"0.40059410"},{"v":0.0161191,"d":"0.01611910"},{"v":6.716300000000001E-4,"d":"0.00067163"},null,{"v":0,"d":"0.00000000"},{"v":0,"d":"0.00000000"},0.10014853,0.00402977,{"v":1.6790999999999998E-4,"d":"0.00016791"}]
[null,"Oktober",{"v":0,"d":"0.00000000"},1.70623414,0.47513401,0.01849232,0.00077052,null,{"v":0,"d":"0.00000000"},0.42655854,{"v":0.1187835,"d":"0.11878350"},0.00462308,{"v":1.9263E-4,"d":"0.00019263"}]
[null,"November",{"v":0,"d":"0.00000000"},{"v":0,"d":"0.00000000"},{"v":0.6827622,"d":"0.68276220"},0.02744476,{"v":1.14354E-3,"d":"0.00114354"},null,{"v":0,"d":"0.00000000"},{"v":0,"d":"0.00000000"},0.17069055,0.00686119,0.00028589]
[null,"December",{"v":0,"d":"0.00000000"},{"v":0,"d":"0.00000000"},0.88908125,0.03458791,{"v":1.4411699999999999E-3,"d":"0.00144117"},null,{"v":0,"d":"0.00000000"},{"v":0,"d":"0.00000000"},0.22227031,0.00864698,{"v":0.0003603,"d":"0.00036030"}]

{"sheet":"Neutrality charge","index":4,"n_rows":42,"n_cols":19,"rows_kept":42,"merged":[[7,2,7,6],[7,8,7,12],[7,14,7,18],[12,2,23,2],[12,3,14,3],[12,8,23,8],[12,9,14,9],[12,14,23,14],[12,15,14,15],[15,3,17,3],[15,9,17,9],[15,15,17,15],[18,3,20,3],[18,9,20,9],[18,15,20,15],[21,3,23,3],[21,9,23,9],[21,15,23,15],[25,2,25,6],[25,8,25,12],[30,2,41,2],[30,3,32,3],[30,8,41,8],[30,9,32,9],[33,3,35,3],[33,9,35,9],[36,3,38,3],[36,9,38,9],[39,3,41,3],[39,9,41,9]]}
[]
[]
[]
[null,"NEUTRALITY CHARGE 2026 (as established by GTS in accordance with calculation methodology as stated in the Transmission Code Gas - TSO)"]
[]
[null,"Charges are all rounded to 8 decimals. Within-day prices are rounded up. "]
[]
[null,"Charge FIRM capacity for interconnection points","ENTRY REGULAR",{"$nulls":5},"ENTRY STORAGE",{"$nulls":5},"ENTRY LNG"]
[null,"Payable charge FIRM capacity for domestic points"]
[null,null,"Year","Quarter","Month","Day","Within-day",null,"Year","Quarter","Month","Day","Within-day",null,"Year","Quarter","Month","Day","Within-day"]
[null,null,"EUR/kWh/h/Y","EUR/kWh/h/Q","EUR/kWh/h/M","EUR/kWh/h/DA","EUR/kWh/h/WID",null,"EUR/kWh/h/Y","EUR/kWh/h/Q","EUR/kWh/h/M","EUR/kWh/h/DA","EUR/kWh/h/WID",null,"EUR/kWh/h/Y","EUR/kWh/h/Q","EUR/kWh/h/M","EUR/kWh/h/DA","EUR/kWh/h/WID"]
[]
[null,"Januari",0.04739454,0.02164892,0.01035506,0.00040289,{"v":1.679E-5,"d":"0.00001679"},null,0.01184864,0.00541223,0.00258876,{"v":1.0072E-4,"d":"0.00010072"},{"v":4.2e-06,"d":"0.00000420"},null,0.03791563,0.01731913,0.00828405,0.00032231,{"v":1.343E-5,"d":"0.00001343"}]
[null,"Februari",null,null,{"v":0.0083604,"d":"0.00836040"},0.00036017,{"v":1.501E-5,"d":"0.00001501"},{"$nulls":3},{"v":0.0020901,"d":"0.00209010"},{"v":9.004e-05,"d":"0.00009004"},{"v":3.76E-6,"d":"0.00000376"},{"$nulls":3},0.00668832,0.00028813,{"v":1.201E-5,"d":"0.00001201"}]
[null,"Maart",null,null,0.00723948,0.00028154,{"v":1.174e-05,"d":"0.00001174"},{"$nulls":3},0.00180987,{"v":7.039e-05,"d":"0.00007039"},{"v":2.94e-06,"d":"0.00000294"},{"$nulls":3},0.00579159,0.00022523,{"v":9.39e-06,"d":"0.00000939"}]
[null,"April",null,0.01157985,0.00522379,{"v":2.0996E-4,"d":"0.00020996"},{"v":8.75e-06,"d":"0.00000875"},null,null,0.00289496,0.00130595,{"v":5.249e-05,"d":"0.00005249"},{"v":2.1899999999999998E-6,"d":"0.00000219"},null,null,0.00926388,0.00417903,0.00016797,{"v":7e-06,"d":"0.00000700"}]
[null,"Mei",null,null,0.00478204,{"v":1.861E-4,"d":"0.00018610"},{"v":7.76e-06,"d":"0.00000776"},{"$nulls":3},0.00119551,{"v":4.653e-05,"d":"0.00004653"},{"v":1.94e-06,"d":"0.00000194"},{"$nulls":3},0.00382564,{"v":1.4888E-4,"d":"0.00014888"},{"v":6.21e-06,"d":"0.00000621"}]
[null,"Juni",null,null,{"v":0.0038857,"d":"0.00388570"},0.00015634,{"v":6.52e-06,"d":"0.00000652"},{"$nulls":3},0.00097143,{"v":3.908e-05,"d":"0.00003908"},{"v":1.6299999999999999E-6,"d":"0.00000163"},{"$nulls":3},0.00310856,0.00012507,{"v":5.22E-6,"d":"0.00000522"}]
[null,"Juli",null,0.00939256,{"v":3.79182E-3,"d":"0.00379182"},{"v":1.4747E-4,"d":"0.00014747"},{"v":6.1499999999999996E-6,"d":"0.00000615"},null,null,0.00234814,0.00094796,{"v":3.687e-05,"d":"0.00003687"},{"v":1.5399999999999999E-6,"d":"0.00000154"},null,null,0.00751405,{"v":3.03346E-3,"d":"0.00303346"},0.00011798,{"v":4.92e-06,"d":"0.00000492"}]
[null,"Augustus",null,null,{"v":3.60465E-3,"d":"0.00360465"},0.00014043,{"v":5.86e-06,"d":"0.00000586"},{"$nulls":3},0.00090116,{"v":3.511e-05,"d":"0.00003511"},{"v":1.47e-06,"d":"0.00000147"},{"$nulls":3},0.00288372,{"v":1.1234E-4,"d":"0.00011234"},{"v":4.69E-6,"d":"0.00000469"}]
[null,"September",null,null,0.00387402,0.00015588,{"v":6.5e-06,"d":"0.00000650"},{"$nulls":3},{"v":0.0009685,"d":"0.00096850"},{"v":3.897e-05,"d":"0.00003897"},{"v":1.6299999999999999E-6,"d":"0.00000163"},{"$nulls":3},0.00309921,0.00012471,{"v":5.2e-06,"d":"0.00000520"}]
[null,"Oktober",null,0.01650044,{"v":4.59487E-3,"d":"0.00459487"},0.00017883,{"v":7.46e-06,"d":"0.00000746"},null,null,0.00412511,{"v":1.14872E-3,"d":"0.00114872"},{"v":4.471e-05,"d":"0.00004471"},{"v":1.8699999999999999E-6,"d":"0.00000187"},null,null,0.01320035,0.00367589,{"v":1.4307E-4,"d":"0.00014307"},{"v":5.97e-06,"d":"0.00000597"}]
[null,"November",null,null,{"v":6.60277E-3,"d":"0.00660277"},0.00026541,{"v":1.1059999999999999E-5,"d":"0.00001106"},{"$nulls":3},{"v":1.65069E-3,"d":"0.00165069"},{"v":6.635E-5,"d":"0.00006635"},{"v":2.7699999999999997E-6,"d":"0.00000277"},{"$nulls":3},0.00528222,0.00021233,{"v":8.85E-6,"d":"0.00000885"}]
[null,"December",null,null,0.00859802,{"v":3.3449E-4,"d":"0.00033449"},{"v":1.394E-5,"d":"0.00001394"},{"$nulls":3},{"v":0.0021495,"d":"0.00214950"},{"v":8.362e-05,"d":"0.00008362"},{"v":3.49E-6,"d":"0.00000349"},{"$nulls":3},0.00687842,{"v":2.6759E-4,"d":"0.00026759"},{"v":1.115E-5,"d":"0.00001115"}]
[]
[null,"Charge FIRM capacity for interconnection points","EXIT NON-STORAGE",{"$nulls":5},"EXIT STORAGE"]
[null,"Payable charge FIRM capacity for domestic points"]
[null,null,"Year","Quarter","Month","Day","Within-day",null,"Year","Quarter","Month","Day","Within-day"]
[null,null,"EUR/kWh/h/Y","EUR/kWh/h/Q","EUR/kWh/h/M","EUR/kWh/h/DA","EUR/kWh/h/WID",null,"EUR/kWh/h/Y","EUR/kWh/h/Q","EUR/kWh/h/M","EUR/kWh/h/DA","EUR/kWh/h/WID"]
[]
[null,"Januari",0.04064864,0.01856752,0.00888117,0.00034554,{"v":1.44e-05,"d":"0.00001440"},null,0.01016216,0.00464188,0.00222029,{"v":8.639e-05,"d":"0.00008639"},{"v":3.6e-06,"d":"0.00000360"}]
[null,"Februari",null,null,0.00717042,{"v":0.0003089,"d":"0.00030890"},{"v":1.288E-5,"d":"0.00001288"},{"$nulls":3},{"v":1.79261E-3,"d":"0.00179261"},{"v":7.723e-05,"d":"0.00007723"},{"v":3.22e-06,"d":"0.00000322"}]
[null,"Maart",null,null,0.00620905,{"v":2.4147E-4,"d":"0.00024147"},{"v":1.007E-5,"d":"0.00001007"},{"$nulls":3},{"v":1.55226E-3,"d":"0.00155226"},{"v":6.037E-5,"d":"0.00006037"},{"v":2.52E-6,"d":"0.00000252"}]
[null,"April",null,0.00993163,0.00448026,{"v":1.8008E-4,"d":"0.00018008"},{"v":7.51e-06,"d":"0.00000751"},null,null,0.00248291,{"v":1.12006E-3,"d":"0.00112006"},{"v":4.502e-05,"d":"0.00004502"},{"v":1.88E-6,"d":"0.00000188"}]
[null,"Mei",null,null,0.00410139,0.00015962,{"v":6.66e-06,"d":"0.00000666"},{"$nulls":3},{"v":1.02535E-3,"d":"0.00102535"},{"v":3.99e-05,"d":"0.00003990"},{"v":1.6699999999999999E-6,"d":"0.00000167"}]
[null,"Juni",null,null,0.00333263,0.00013408,{"v":5.59e-06,"d":"0.00000559"},{"$nulls":3},{"v":8.3316E-4,"d":"0.00083316"},{"v":3.352e-05,"d":"0.00003352"},{"v":1.4e-06,"d":"0.00000140"}]
[null,"Juli",null,0.00805567,0.00325211,{"v":1.2648E-4,"d":"0.00012648"},{"v":5.28e-06,"d":"0.00000528"},null,null,0.00201392,0.00081303,{"v":3.162e-05,"d":"0.00003162"},{"v":1.3199999999999999E-6,"d":"0.00000132"}]
[null,"Augustus",null,null,{"v":3.09158E-3,"d":"0.00309158"},0.00012044,{"v":5.02e-06,"d":"0.00000502"},{"$nulls":3},0.00077289,{"v":3.011e-05,"d":"0.00003011"},{"v":1.26E-6,"d":"0.00000126"}]
[null,"September",null,null,0.00332261,{"v":1.337E-4,"d":"0.00013370"},{"v":5.58e-06,"d":"0.00000558"},{"$nulls":3},0.00083065,{"v":3.342e-05,"d":"0.00003342"},{"v":1.4e-06,"d":"0.00000140"}]
[null,"Oktober",null,0.01415185,{"v":3.94086E-3,"d":"0.00394086"},{"v":1.5338E-4,"d":"0.00015338"},{"v":6.4e-06,"d":"0.00000640"},null,null,0.00353796,0.00098521,{"v":3.834e-05,"d":"0.00003834"},{"v":1.6e-06,"d":"0.00000160"}]
[null,"November",null,null,0.00566297,0.00022763,{"v":9.49e-06,"d":"0.00000949"},{"$nulls":3},{"v":1.41574E-3,"d":"0.00141574"},{"v":5.691e-05,"d":"0.00005691"},{"v":2.38e-06,"d":"0.00000238"}]
[null,"December",null,null,0.00737422,0.00028688,{"v":1.196e-05,"d":"0.00001196"},{"$nulls":3},0.00184356,{"v":7.172e-05,"d":"0.00007172"},{"v":2.9899999999999997E-6,"d":"0.00000299"}]

{"sheet":"Optimalisation","index":5,"n_rows":83,"n_cols":28,"rows_kept":83,"hidden":true,"merged":[[24,24,24,27],[25,15,25,16],[25,17,25,18],[25,19,25,21],[25,22,25,23],[56,5,56,8],[56,10,56,13]]}
[]
[]
[]
[null,"COLLECTING DATA FOR OPTIMALISATION"]
[]
[null,"Helping cell: row number","Numbers of months applicable","Month number","Final \nmonth","Year","Month \nname","Helping cell: \ncode Y&M","Days per month in desired period"]
[{"$nulls":11},"date","year","quarter","month","day"]
[null,0,null,{"$f":"O8","v":1},null,{"$f":"M8","v":2026},{"$f":"IF(D8=\"\",D8,INDEX(C$60:C$71,$D8,1))","v":"January"},{"$f":"CONCATENATE(F8,G8)","v":"2026January"},{"$f":"P19","v":31},null,"Start date",{"$f":"'Period booking'!D8","v":"2026-01-01"},{"$f":"YEAR(L8)","v":2026},"n.a.",{"$f":"MONTH(L8)","v":1},{"$f":"DAY(L8)","v":1}]
[null,{"$f":"B8+1","v":1},{"$f":"IF(B9>P$18,\"\",B9)","v":1},{"$f":"IF($C9=\"\",$C9,IF($D8+1=13,1,IF($D8+1>13,$D8+1-12,$D8+1)))","v":2},{"$f":"IF(AND(D10=\"\",D9<>\"\"),\"END\",\"\")","v":""},{"$f":"IF(D9=\"\",\"\",IF(AND($D9>$D8,$F8<$M$9),$M$8,$M$9))","v":2026},{"$f":"IF(D9=\"\",D9,INDEX(C$60:C$71,D9,1))","v":"February"},"2026February",{"$f":"IF($E9=\"END\",$P$9,IF($D9=\"\",\"\",VLOOKUP($H9,$D$60:$I$83,5,FALSE)))","v":28},null,"End date",{"$f":"'Period booking'!D9","v":"2026-12-31"},{"$f":"YEAR(L9)","v":2026},"n.a.",{"$f":"MONTH(L9)","v":12},{"$f":"DAY(L9)","v":31}]
[null,2,2,3,"",2026,"March","2026March",31]
[null,3,3,4,"",2026,"April","2026April",30,null,"Capacity",{"$nulls":3},"kWh/h",{"$f":"'Period booking'!D11","v":{"v":100000,"d":"100,000"}}]
[null,4,4,5,"",2026,"May","2026May",31,null,"Applicable yearly reserve price",{"$nulls":3},"EUR/kWh/h/y",{"$f":"K60","v":{"v":4.94149823,"d":"4.9415"}}]
[null,5,5,6,"",2026,"June","2026June",30,null,"Payable amount in case of yearly (flat) booking",{"$nulls":3},"EUR/y",{"$f":"P11*P12","v":{"v":494149.823,"d":"494,150"}}]
[null,6,6,7,"",2026,"July","2026July",31,null,"Payable amount after optimalisation",{"$nulls":3},"EUR/y",{"$f":"X53","v":{"v":494149.82299999986,"d":"494,150"}}]
[null,7,7,8,"",2026,"August","2026August",31,null,"Optimisation to yearly booking?",{"$nulls":4},{"$f":"IF(P13<P14,\"Yes\", \"No\")","v":"No"}]
[null,8,8,9,"",2026,"September","2026September",30]
[null,9,9,10,"",2026,"October","2026October",31,null,"Check same month:",{"$nulls":4},{"$f":"IF(AND(M8=M9,O8=O9),\"ZELFDEMAAND\",\"No\")","v":"No"}]
[null,10,10,11,"",2026,"November","2026November",30,null,"Number of months involved after starting month:",{"$nulls":4},{"$f":"IF(($O$9-$O$8)>0,($O$9-$O$8),IF(($O$9-$O$8)<0,IF($P$8=1,12+($O$9-$O$8),12+($O$9-$O$8)),IF($M$9=$M$8,0,13)))","v":11}]
[null,11,11,12,"END",2026,"December","2026December",31,null,"Number of days involved in starting month",{"$nulls":4},{"$f":"IF(P$17=\"ZELFDEMAAND\",$P$9-$P$8+1,_xlfn.DAYS(EOMONTH($L$8,0),$L$8)+1)","v":31}]
[null,12,"","","","","","",""]
[]
[]
[null,"OPTIMISATION FOR DESIRED PERIOD BOOKING INTO NON-YEARLY CAPACITY PRODUCTS"]
[]
[{"$nulls":24},"Optimised non-yearly product"]
[null,"Helping cell: row number","Year","Month","Helping cell: \ncode Y&M","Month number","Days per month in desired period","Days in month","Quarter number","Days in quarter","Days in year","Reserve price for daily products","Reserve price for monthly products","Reserve price for quarterly products","Reserve price for a yearly product","Optimisation 2.1.2. (c) ",null,"Optimisation 2.1.2. (b) ",null,"Optimisation 2.1.2. (a) ",null,null,"Optimised period booking",null,"Year","Quarter","Month","Day-ahead"]
[{"$nulls":11},"EUR/month","EUR/month","EUR/quarter","EUR/year","MIN \n(D vs M)","EUR/month","MIN \n(D;M vs Q)","EUR/month","MIN \n(D;M;Q vs Y)","correction yearly product","EUR/month","Product type","EUR/month"]
[{"$nulls":20},{"$f":"IF($T$53=12,IF($T28=\"Y\",$T28,\"\"),IF($T$53=13,IF($T28=\"\",\"\",IF(OR(AND($T28=\"Y\",$T27=\"\"),AND($T28=\"Y\",$T29=\"\")),IF($S28<$S40,$P28,IF(COUNTIF($U27:$U$29,\"Y\")=12,$P27)),\"Y\")),IF($T$53=11,IF(OR(AND($T28=\"\",$T27=\"Y\"),AND($T28=\"\",$T29=\"Y\")),\"?\",IF($T28=\"Y\",$T28,\"\")),\"\")))","v":""}]
[null,1,{"$f":"M$8","v":2026},"January",{"$f":"CONCATENATE(C29,D29)","v":"2026January"},1,{"$f":"_xlfn.IFNA(VLOOKUP(E29,H$8:I$20,2,FALSE),0)","v":31},{"$f":"INDEX($B$60:$J$83,$B29,7)","v":31},{"$f":"INDEX($B$60:$J$83,$B29,6)","v":1},{"$f":"INDEX($B$60:$J$83,$B29,8)","v":90},{"$f":"IF(U29=\"Y\",SUMIF($U$29:$U$52,\"Y\",$H$29:$H$52),\"\")","v":365},{"$f":"N60*G29","v":{"v":1.30218972,"d":"€ 1.302"}},{"$f":"IF($G29<>0,M60,0)","v":{"v":1.07964967,"d":"€ 1.080"}},{"$f":"IF($G29<>0,L60,0)","v":{"v":2.25718162,"d":"€ 2.257"}},{"$f":"IF($G29<>0,K60,0)","v":{"v":4.94149823,"d":"€ 4.941"}},{"$f":"IF($G29<>0,IF(L29<M29,\"D\", \"M\"),\"\")","v":"M"},{"$f":"IF(P29=\"D\",L29,M29)","v":{"v":1.07964967,"d":"€ 1.080"}},{"$f":"IF($G29=0,\"\",IF($I29<>$I28,IF(SUM($Q29:$Q31)>=$N29,\"Q\",\"\"),IF($R28=\"Q\",\"Q\",\"\")))","v":"Q"},{"$f":"IF($R29=\"Q\",$N29*$H29/$J29,$Q29)","v":{"v":0.7774736691111112,"d":"€ 0.777"}},{"$f":"IF($G29=0,\"\",IF(SUM($S29:$S40)>=$O29,\"Y\",IF($T28=\"Y\",\"Y\",\"\")))","v":"Y"},{"$f":"IF($T$53=12,IF($T29=\"Y\",$T29,\"\"),IF($T$53=13,IF($T29=\"\",\"\",IF(AND($T29=\"Y\",$T28=\"\"),IF($S29<$S41,$P29,\"Y\"),IF(AND($T29=\"Y\",$T30=\"\"),IF($S29<$S17,$P29,\"Y\"),\"Y\"))),IF($T$53=11,IF(OR(AND($T29=\"\",$T28=\"Y\"),AND($T29=\"\",$T30=\"Y\")),\"?\",IF($T29=\"Y\",$T29,\"\")),IF($T$53=10,IF(OR(AND($T29=\"\",$T28=\"Y\"),AND($T29=\"\",$T30=\"Y\"),AND($T29=\"\",$T28=\"\",$T27=\"Y\"),AND($T29=\"\",$T30=\"\",$T31=\"Y\")),\"?\",IF($T29=\"Y\",$T29,\"\")),IF($T$53=9,IF(OR(AND($T29=\"\",$T28=\"Y\"),AND($T29=\"\",$T30=\"Y\"),AND($T29=\"\",$T28=\"\",$T27=\"Y\"),AND($T29=\"\",$T30=\"\",$T31=\"Y\"),AND($T29=\"\",$T28=\"\",$T27=\"\",$T26=\"Y\"),AND($T29=\"\",$T30=\"\",$T31=\"\",$T32=\"Y\")),\"?\",IF($T29=\"Y\",$T29,\"\")),\"\")))))","v":"Y"},{"$f":"IF($U29=\"\",0,IF($T$53=11,\"no 12th month in yearly booking\",IF($T$53=10,\"no 11th and 12th month in yearly booking\",IF($T$53=9,\"no 10th, 11th and 12th month in yearly booking\",IF($U29=\"Y\",$O29*$H29/$K29,$S29)))))","v":{"v":0.41968889076712323,"d":"€ 0.420"}},{"$f":"IF(AND($G29=0,$U29=\"\"),\"\",IF(OR($U29=\"Y\",$U29=\"?\"),$U29,IF($R29=\"Q\",$R29,$P29)))","v":"Y"},{"$f":"IFERROR(IF(AND($G29=0,$U29=\"\"),\"\",IF(OR($U29=\"Y\",$U29=\"?\"),$V29,IF($R29=\"Q\",$S29,$Q29)))*$P$11,$V29)","v":{"v":41968.88907671232,"d":"€ 41,969"}},{"$f":"IF($W29=\"Y\",\"Y\",IF($W29=\"?\",$W29,\"\"))","v":"Y"},{"$f":"IF($W29=\"Q\",\"Q\"&$I29,\"\")","v":""},{"$f":"IF($W29=\"M\",\"M\"&$F29,\"\")","v":""},{"$f":"IF($W29=\"D\",$G29,\"\")","v":""}]
[null,{"$f":"B29+1","v":2},2026,"February","2026February",2,{"$f":"_xlfn.IFNA(VLOOKUP(E30,H$8:I$20,2,FALSE),0)","v":28},{"$f":"INDEX($B$60:$J$83,$B30,7)","v":28},{"$f":"INDEX($B$60:$J$83,$B30,6)","v":1},{"$f":"INDEX($B$60:$J$83,$B30,8)","v":90},{"$f":"IF(U30=\"Y\",SUMIF($U$29:$U$52,\"Y\",$H$29:$H$52),\"\")","v":365},{"v":1.051456,"d":"€ 1.051"},{"v":0.87168029,"d":"€ 0.872"},{"v":2.25718162,"d":"€ 2.257"},{"v":4.94149823,"d":"€ 4.941"},{"$f":"IF($G30<>0,IF(L30<M30,\"D\", \"M\"),\"\")","v":"M"},{"$f":"IF(P30=\"D\",L30,M30)","v":{"v":0.87168029,"d":"€ 0.872"}},{"$f":"IF($G30=0,\"\",IF($I30<>$I29,IF(SUM($Q30:$Q32)>=$N30,\"Q\",\"\"),IF($R29=\"Q\",\"Q\",\"\")))","v":"Q"},{"$f":"IF($R30=\"Q\",$N30*$H30/$J30,$Q30)","v":{"v":0.7022342817777777,"d":"€ 0.702"}},{"$f":"IF($G30=0,\"\",IF(SUM($S30:$S41)>=$O30,\"Y\",IF($T29=\"Y\",\"Y\",\"\")))","v":"Y"},"Y",{"v":0.37907383682191775,"d":"€ 0.379"},"Y",{"$f":"IFERROR(IF(AND($G30=0,$U30=\"\"),\"\",IF(OR($U30=\"Y\",$U30=\"?\"),$V30,IF($R30=\"Q\",$S30,$Q30)))*$P$11,$V30)","v":{"v":37907.38368219177,"d":"€ 37,907"}},{"$f":"IF($W30=\"Y\",\"Y\",IF($W30=\"?\",$W30,\"\"))","v":"Y"},"","",""]
[null,3,2026,"March","2026March",3,31,31,{"$f":"INDEX($B$60:$J$83,$B31,6)","v":1},90,365,{"v":0.90999043,"d":"€ 0.910"},{"v":0.75481047,"d":"€ 0.755"},{"v":2.25718162,"d":"€ 2.257"},{"v":4.94149823,"d":"€ 4.941"},"M",{"$f":"IF(P31=\"D\",L31,M31)","v":{"v":0.75481047,"d":"€ 0.755"}},"Q",{"$f":"IF($R31=\"Q\",$N31*$H31/$J31,$Q31)","v":{"v":0.7774736691111112,"d":"€ 0.777"}},{"$f":"IF($G31=0,\"\",IF(SUM($S31:$S42)>=$O31,\"Y\",IF($T30=\"Y\",\"Y\",\"\")))","v":"Y"},"Y",{"v":0.41968889076712323,"d":"€ 0.420"},"Y",{"v":41968.88907671232,"d":"€ 41,969"},"Y","","",""]
[null,4,2026,"April","2026April",4,30,30,2,91,365,{"v":0.6567455999999999,"d":"€ 0.657"},{"v":0.54464787,"d":"€ 0.545"},{"v":1.20735017,"d":"€ 1.207"},{"v":4.94149823,"d":"€ 4.941"},"M",{"$f":"IF(P32=\"D\",L32,M32)","v":{"v":0.54464787,"d":"€ 0.545"}},"Q",{"$f":"IF($R32=\"Q\",$N32*$H32/$J32,$Q32)","v":{"v":0.39802752857142853,"d":"€ 0.398"}},{"$f":"IF($G32=0,\"\",IF(SUM($S32:$S43)>=$O32,\"Y\",IF($T31=\"Y\",\"Y\",\"\")))","v":"Y"},"Y",{"v":0.4061505394520548,"d":"€ 0.406"},"Y",{"v":40615.05394520548,"d":"€ 40,615"},"Y","","",""]
[null,5,2026,"May","2026May",5,31,31,2,91,{"$f":"IF(U33=\"Y\",SUMIF($U$29:$U$52,\"Y\",$H$29:$H$52),\"\")","v":365},{"v":0.60151935,"d":"€ 0.602"},{"v":0.4985904,"d":"€ 0.499"},{"v":1.20735017,"d":"€ 1.207"},{"v":4.94149823,"d":"€ 4.941"},"M",{"$f":"IF(P33=\"D\",L33,M33)","v":{"v":0.4985904,"d":"€ 0.499"}},"Q",{"$f":"IF($R33=\"Q\",$N33*$H33/$J33,$Q33)","v":{"v":0.4112951128571429,"d":"€ 0.411"}},{"$f":"IF($G33=0,\"\",IF(SUM($S33:$S44)>=$O33,\"Y\",IF($T32=\"Y\",\"Y\",\"\")))","v":"Y"},"Y",{"v":0.41968889076712323,"d":"€ 0.420"},"Y",{"v":41968.88907671232,"d":"€ 41,969"},{"$f":"IF($W33=\"Y\",\"Y\",IF($W33=\"?\",$W33,\"\"))","v":"Y"},"","",""]
[null,6,2026,"June","2026June",6,30,30,2,91,{"$f":"IF(U34=\"Y\",SUMIF($U$29:$U$52,\"Y\",$H$29:$H$52),\"\")","v":365},{"v":0.4890051000000001,"d":"€ 0.489"},{"v":0.40513516,"d":"€ 0.405"},{"v":1.20735017,"d":"€ 1.207"},{"v":4.94149823,"d":"€ 4.941"},"M",{"v":0.40513516,"d":"€ 0.405"},"Q",{"$f":"IF($R34=\"Q\",$N34*$H34/$J34,$Q34)","v":{"v":0.39802752857142853,"d":"€ 0.398"}},{"$f":"IF($G34=0,\"\",IF(SUM($S34:$S45)>=$O34,\"Y\",IF($T33=\"Y\",\"Y\",\"\")))","v":"Y"},"Y",{"v":0.4061505394520548,"d":"€ 0.406"},{"$f":"IF(AND($G34=0,$U34=\"\"),\"\",IF(OR($U34=\"Y\",$U34=\"?\"),$U34,IF($R34=\"Q\",$R34,$P34)))","v":"Y"},{"v":40615.05394520548,"d":"€ 40,615"},"Y","","",""]
[null,7,2026,"July","2026July",7,31,31,3,92,365,{"v":0.47666158,"d":"€ 0.477"},{"v":0.39534693,"d":"€ 0.395"},{"v":0.9792966399999999,"d":"€ 0.979"},{"v":4.94149823,"d":"€ 4.941"},"M",{"$f":"IF(P35=\"D\",L35,M35)","v":{"v":0.39534693,"d":"€ 0.395"}},"Q",{"v":0.32998038956521736,"d":"€ 0.330"},{"$f":"IF($G35=0,\"\",IF(SUM($S35:$S46)>=$O35,\"Y\",IF($T34=\"Y\",\"Y\",\"\")))","v":"Y"},"Y",{"v":0.41968889076712323,"d":"€ 0.420"},{"$f":"IF(AND($G35=0,$U35=\"\"),\"\",IF(OR($U35=\"Y\",$U35=\"?\"),$U35,IF($R35=\"Q\",$R35,$P35)))","v":"Y"},{"v":41968.88907671232,"d":"€ 41,969"},"Y","","",""]
[null,8,2026,"August","2026August",8,31,31,3,92,365,{"v":0.45389331999999993,"d":"€ 0.454"},{"v":0.3758314,"d":"€ 0.376"},{"v":0.9792966399999999,"d":"€ 0.979"},{"v":4.94149823,"d":"€ 4.941"},"M",{"v":0.3758314,"d":"€ 0.376"},"Q",{"v":0.32998038956521736,"d":"€ 0.330"},{"$f":"IF($G36=0,\"\",IF(SUM($S36:$S47)>=$O36,\"Y\",IF($T35=\"Y\",\"Y\",\"\")))","v":"Y"},"Y",{"v":0.41968889076712323,"d":"€ 0.420"},{"$f":"IF(AND($G36=0,$U36=\"\"),\"\",IF(OR($U36=\"Y\",$U36=\"?\"),$U36,IF($R36=\"Q\",$R36,$P36)))","v":"Y"},{"v":41968.88907671232,"d":"€ 41,969"},"Y","","",""]
[null,9,2026,"September","2026September",9,30,30,3,92,365,{"v":0.487584,"d":"€ 0.488"},{"v":0.40391671,"d":"€ 0.404"},{"v":0.9792966399999999,"d":"€ 0.979"},{"v":4.94149823,"d":"€ 4.941"},"M",{"v":0.40391671,"d":"€ 0.404"},"Q",{"v":0.3193358608695652,"d":"€ 0.319"},"Y","Y",{"v":0.4061505394520548,"d":"€ 0.406"},"Y",{"v":40615.05394520548,"d":"€ 40,615"},"Y","","",""]
[null,10,2026,"October","2026October",10,31,31,4,92,365,{"v":0.5780167,"d":"€ 0.578"},{"v":0.47907487,"d":"€ 0.479"},{"v":1.72038599,"d":"€ 1.720"},{"v":4.94149823,"d":"€ 4.941"},"M",{"v":0.47907487,"d":"€ 0.479"},"Q",{"v":0.5796952792391304,"d":"€ 0.580"},"Y","Y",{"v":0.41968889076712323,"d":"€ 0.420"},"Y",{"v":41968.88907671232,"d":"€ 41,969"},"Y","","",""]
[null,11,2026,"November","2026November",11,30,30,4,92,365,{"v":0.8301717,"d":"€ 0.830"},{"v":0.68842517,"d":"€ 0.688"},{"v":1.72038599,"d":"€ 1.720"},{"v":4.94149823,"d":"€ 4.941"},"M",{"v":0.68842517,"d":"€ 0.688"},"Q",{"v":0.5609954315217391,"d":"€ 0.561"},"Y","Y",{"v":0.4061505394520548,"d":"€ 0.406"},"Y",{"v":40615.05394520548,"d":"€ 40,615"},"Y","","",""]
[null,12,2026,"December","2026December",12,31,31,4,92,365,{"v":1.0811184900000002,"d":"€ 1.081"},{"v":0.89645547,"d":"€ 0.896"},{"v":1.72038599,"d":"€ 1.720"},{"v":4.94149823,"d":"€ 4.941"},"M",{"v":0.89645547,"d":"€ 0.896"},"Q",{"v":0.5796952792391304,"d":"€ 0.580"},"Y","Y",{"v":0.41968889076712323,"d":"€ 0.420"},"Y",{"v":41968.88907671232,"d":"€ 41,969"},"Y","","",""]
[null,13,{"$f":"YEAR(L$8+366)","v":2027},"January","2027January",1,0,31,{"$f":"INDEX($B$60:$J$83,$B41,6)","v":1},90,"",0,0,0,0,"",0,"",0,"","",0,"",0,"","","",""]
[null,{"$f":"B41+1","v":14},2027,"February","2027February",2,0,28,{"$f":"INDEX($B$60:$J$83,$B42,6)","v":1},90,"",0,0,0,0,"",0,"",0,"","",0,"",0,"","","",""]
[null,15,2027,"March","2027March",3,0,31,{"$f":"INDEX($B$60:$J$83,$B43,6)","v":1},90,"",0,0,0,0,"",0,"",0,"","",0,"",0,"","","",""]
[null,16,2027,"April","2027April",4,0,30,2,91,"",0,0,0,0,"",0,"",0,{"$f":"IF($G44=0,\"\",IF(SUM($S44:$S55)>=$O44,\"Y\",IF($T43=\"Y\",\"Y\",\"\")))","v":""},"",0,"",0,"","","",""]
[null,17,2027,"May","2027May",5,0,31,2,91,"",0,0,0,0,"",0,"",0,"","",0,"",0,"","","",""]
[null,18,2027,"June","2027June",6,0,30,2,91,"",0,0,0,0,"",0,"",0,"","",0,"",0,"","","",""]
[null,19,2027,"July","2027July",7,0,31,3,92,"",0,0,0,0,"",0,"",0,"","",0,"",0,"","","",""]
[null,20,2027,"August","2027August",8,0,31,3,92,"",0,0,0,0,"",0,"",0,"","",0,"",0,"","","",""]
[null,21,2027,"September","2027September",9,0,30,3,92,"",0,0,0,0,"",0,"",0,"","",0,"",0,"","","",""]
[null,22,2027,"October","2027October",10,0,31,4,92,"",0,0,0,0,"",0,"",0,"","",0,"",0,"","","",""]
[null,23,2027,"November","2027November",11,0,30,4,92,"",0,0,0,0,"",0,"",0,"","",0,"",0,"","","",""]
[null,24,2027,"December","2027December",12,0,31,4,92,"",0,0,0,0,"",0,"",0,"","",0,"",0,"","","",""]
[{"$nulls":19},{"$f":"COUNTIF($T$29:$T$52,\"Y\")","v":12},{"$nulls":3},{"$f":"SUM(X29:X52)","v":{"v":494149.82299999986,"d":"€ 494,150"}}]
[]
[null,"HELPING TABLE: COLLECTING DATES, NUMBER OF DAYS IN MONTH AND QUARTER AND RESERVE PRICES"]
[]
[{"$nulls":5},"DATE INFORMATION",{"$nulls":4},"RESERVE PRICES"]
[]
[null,"Year","Month","Helping cell: \ncode Y&M",null,"Month \nnumber","Quarter \nnumber","Number of days in month","Number of days in quarter",null,"Year","Quarter","Month","Day"]
[null,{"$f":"M$8","v":2026},"January",{"$f":"CONCATENATE(B60,C60)","v":"2026January"},null,1,1,{"$f":"DAY(EOMONTH(DATE(B60,F60,1),0))","v":31},{"$f":"IF(G60<>G59,SUM(H60:H62),I59)","v":90},null,{"$f":"IF('Period booking'!$D$10=\"Exit storage\",INDEX(exitstorage,1,1),IF('Period booking'!$D$10=\"Exit non-storage\",INDEX(exit,1,1),IF('Period booking'!$D$10=\"Entry storage\",INDEX(entrystorage,1,1),IF('Period booking'!$D$10=\"Entry Regular\",INDEX(entry,1,1),IF('Period booking'!$D$10=\"Entry LNG\",INDEX(entryLNG,1,1))))))","v":4.94149823},{"$f":"IF('Period booking'!$D$10=\"Exit storage\",INDEX(exitstorage,$G60,2),IF('Period booking'!$D$10=\"Exit non-storage\",INDEX(exit,$G60,2),IF('Period booking'!$D$10=\"Entry storage\",INDEX(entrystorage,$G60,2),IF('Period booking'!$D$10=\"Entry Regular\",INDEX(entry,$G60,2),IF('Period booking'!$D$10=\"Entry LNG\",INDEX(entryLNG,$G60,2))))))","v":2.25718162},{"$f":"IF('Period booking'!$D$10=\"Exit storage\",INDEX(exitstorage,$F60,3),IF('Period booking'!$D$10=\"Exit non-storage\",INDEX(exit,$F60,3),IF('Period booking'!$D$10=\"Entry storage\",INDEX(entrystorage,$F60,3),IF('Period booking'!$D$10=\"Entry Regular\",INDEX(entry,$F60,3),IF('Period booking'!$D$10=\"Entry LNG\",INDEX(entryLNG,$F60,3))))))","v":1.07964967},{"$f":"IF('Period booking'!$D$10=\"Exit storage\",INDEX(exitstorage,$F60,4),IF('Period booking'!$D$10=\"Exit non-storage\",INDEX(exit,$F60,4),IF('Period booking'!$D$10=\"Entry storage\",INDEX(entrystorage,$F60,4),IF('Period booking'!$D$10=\"Entry Regular\",INDEX(entry,$F60,4),IF('Period booking'!$D$10=\"Entry non-storage\",INDEX(entry,1,1),IF('Period booking'!$D$10=\"Entry LNG\",INDEX(entryLNG,$F60,4)))))))","v":0.04200612}]
[null,2026,"February",{"$f":"CONCATENATE(B61,C61)","v":"2026February"},null,2,1,{"$f":"DAY(EOMONTH(DATE(B61,F61,1),0))","v":28},{"$f":"IF(G61<>G60,SUM(H61:H63),I60)","v":90},null,{"$f":"IF('Period booking'!$D$10=\"Exit storage\",INDEX(exitstorage,1,1),IF('Period booking'!$D$10=\"Exit non-storage\",INDEX(exit,1,1),IF('Period booking'!$D$10=\"Entry storage\",INDEX(entrystorage,1,1),IF('Period booking'!$D$10=\"Entry Regular\",INDEX(entry,1,1),IF('Period booking'!$D$10=\"Entry LNG\",INDEX(entryLNG,1,1))))))","v":4.94149823},{"$f":"IF('Period booking'!$D$10=\"Exit storage\",INDEX(exitstorage,$G61,2),IF('Period booking'!$D$10=\"Exit non-storage\",INDEX(exit,$G61,2),IF('Period booking'!$D$10=\"Entry storage\",INDEX(entrystorage,$G61,2),IF('Period booking'!$D$10=\"Entry Regular\",INDEX(entry,$G61,2),IF('Period booking'!$D$10=\"Entry LNG\",INDEX(entryLNG,$G61,2))))))","v":2.25718162},{"$f":"IF('Period booking'!$D$10=\"Exit storage\",INDEX(exitstorage,$F61,3),IF('Period booking'!$D$10=\"Exit non-storage\",INDEX(exit,$F61,3),IF('Period booking'!$D$10=\"Entry storage\",INDEX(entrystorage,$F61,3),IF('Period booking'!$D$10=\"Entry Regular\",INDEX(entry,$F61,3),IF('Period booking'!$D$10=\"Entry LNG\",INDEX(entryLNG,$F61,3))))))","v":0.87168029},{"$f":"IF('Period booking'!$D$10=\"Exit storage\",INDEX(exitstorage,$F61,4),IF('Period booking'!$D$10=\"Exit non-storage\",INDEX(exit,$F61,4),IF('Period booking'!$D$10=\"Entry storage\",INDEX(entrystorage,$F61,4),IF('Period booking'!$D$10=\"Entry Regular\",INDEX(entry,$F61,4),IF('Period booking'!$D$10=\"Entry non-storage\",INDEX(entry,1,1),IF('Period booking'!$D$10=\"Entry LNG\",INDEX(entryLNG,$F61,4)))))))","v":0.037552}]
[null,2026,"March","2026March",null,3,1,31,{"$f":"IF(G62<>G61,SUM(H62:H64),I61)","v":90},null,{"$f":"IF('Period booking'!$D$10=\"Exit storage\",INDEX(exitstorage,1,1),IF('Period booking'!$D$10=\"Exit non-storage\",INDEX(exit,1,1),IF('Period booking'!$D$10=\"Entry storage\",INDEX(entrystorage,1,1),IF('Period booking'!$D$10=\"Entry Regular\",INDEX(entry,1,1),IF('Period booking'!$D$10=\"Entry LNG\",INDEX(entryLNG,1,1))))))","v":4.94149823},{"$f":"IF('Period booking'!$D$10=\"Exit storage\",INDEX(exitstorage,$G62,2),IF('Period booking'!$D$10=\"Exit non-storage\",INDEX(exit,$G62,2),IF('Period booking'!$D$10=\"Entry storage\",INDEX(entrystorage,$G62,2),IF('Period booking'!$D$10=\"Entry Regular\",INDEX(entry,$G62,2),IF('Period booking'!$D$10=\"Entry LNG\",INDEX(entryLNG,$G62,2))))))","v":2.25718162},{"$f":"IF('Period booking'!$D$10=\"Exit storage\",INDEX(exitstorage,$F62,3),IF('Period booking'!$D$10=\"Exit non-storage\",INDEX(exit,$F62,3),IF('Period booking'!$D$10=\"Entry storage\",INDEX(entrystorage,$F62,3),IF('Period booking'!$D$10=\"Entry Regular\",INDEX(entry,$F62,3),IF('Period booking'!$D$10=\"Entry LNG\",INDEX(entryLNG,$F62,3))))))","v":0.75481047},{"$f":"IF('Period booking'!$D$10=\"Exit storage\",INDEX(exitstorage,$F62,4),IF('Period booking'!$D$10=\"Exit non-storage\",INDEX(exit,$F62,4),IF('Period booking'!$D$10=\"Entry storage\",INDEX(entrystorage,$F62,4),IF('Period booking'!$D$10=\"Entry Regular\",INDEX(entry,$F62,4),IF('Period booking'!$D$10=\"Entry non-storage\",INDEX(entry,1,1),IF('Period booking'!$D$10=\"Entry LNG\",INDEX(entryLNG,$F62,4)))))))","v":0.02935453}]
[null,2026,"April","2026April",null,4,4,30,91,null,{"$f":"IF('Period booking'!$D$10=\"Exit storage\",INDEX(exitstorage,1,1),IF('Period booking'!$D$10=\"Exit non-storage\",INDEX(exit,1,1),IF('Period booking'!$D$10=\"Entry storage\",INDEX(entrystorage,1,1),IF('Period booking'!$D$10=\"Entry Regular\",INDEX(entry,1,1),IF('Period booking'!$D$10=\"Entry LNG\",INDEX(entryLNG,1,1))))))","v":4.94149823},{"$f":"IF('Period booking'!$D$10=\"Exit storage\",INDEX(exitstorage,$G63,2),IF('Period booking'!$D$10=\"Exit non-storage\",INDEX(exit,$G63,2),IF('Period booking'!$D$10=\"Entry storage\",INDEX(entrystorage,$G63,2),IF('Period booking'!$D$10=\"Entry Regular\",INDEX(entry,$G63,2),IF('Period booking'!$D$10=\"Entry LNG\",INDEX(entryLNG,$G63,2))))))","v":1.20735017},{"$f":"IF('Period booking'!$D$10=\"Exit storage\",INDEX(exitstorage,$F63,3),IF('Period booking'!$D$10=\"Exit non-storage\",INDEX(exit,$F63,3),IF('Period booking'!$D$10=\"Entry storage\",INDEX(entrystorage,$F63,3),IF('Period booking'!$D$10=\"Entry Regular\",INDEX(entry,$F63,3),IF('Period booking'!$D$10=\"Entry LNG\",INDEX(entryLNG,$F63,3))))))","v":0.54464787},{"$f":"IF('Period booking'!$D$10=\"Exit storage\",INDEX(exitstorage,$F63,4),IF('Period booking'!$D$10=\"Exit non-storage\",INDEX(exit,$F63,4),IF('Period booking'!$D$10=\"Entry storage\",INDEX(entrystorage,$F63,4),IF('Period booking'!$D$10=\"Entry Regular\",INDEX(entry,$F63,4),IF('Period booking'!$D$10=\"Entry non-storage\",INDEX(entry,1,1),IF('Period booking'!$D$10=\"Entry LNG\",INDEX(entryLNG,$F63,4)))))))","v":0.021891519999999998}]
[null,2026,"May","2026May",null,5,4,31,91,null,{"$f":"IF('Period booking'!$D$10=\"Exit storage\",INDEX(exitstorage,1,1),IF('Period booking'!$D$10=\"Exit non-storage\",INDEX(exit,1,1),IF('Period booking'!$D$10=\"Entry storage\",INDEX(entrystorage,1,1),IF('Period booking'!$D$10=\"Entry Regular\",INDEX(entry,1,1),IF('Period booking'!$D$10=\"Entry LNG\",INDEX(entryLNG,1,1))))))","v":4.94149823},{"$f":"IF('Period booking'!$D$10=\"Exit storage\",INDEX(exitstorage,$G64,2),IF('Period booking'!$D$10=\"Exit non-storage\",INDEX(exit,$G64,2),IF('Period booking'!$D$10=\"Entry storage\",INDEX(entrystorage,$G64,2),IF('Period booking'!$D$10=\"Entry Regular\",INDEX(entry,$G64,2),IF('Period booking'!$D$10=\"Entry LNG\",INDEX(entryLNG,$G64,2))))))","v":1.20735017},{"$f":"IF('Period booking'!$D$10=\"Exit storage\",INDEX(exitstorage,$F64,3),IF('Period booking'!$D$10=\"Exit non-storage\",INDEX(exit,$F64,3),IF('Period booking'!$D$10=\"Entry storage\",INDEX(entrystorage,$F64,3),IF('Period booking'!$D$10=\"Entry Regular\",INDEX(entry,$F64,3),IF('Period booking'!$D$10=\"Entry LNG\",INDEX(entryLNG,$F64,3))))))","v":0.4985904},{"$f":"IF('Period booking'!$D$10=\"Exit storage\",INDEX(exitstorage,$F64,4),IF('Period booking'!$D$10=\"Exit non-storage\",INDEX(exit,$F64,4),IF('Period booking'!$D$10=\"Entry storage\",INDEX(entrystorage,$F64,4),IF('Period booking'!$D$10=\"Entry Regular\",INDEX(entry,$F64,4),IF('Period booking'!$D$10=\"Entry non-storage\",INDEX(entry,1,1),IF('Period booking'!$D$10=\"Entry LNG\",INDEX(entryLNG,$F64,4)))))))","v":0.01940385}]
[null,2026,"June","2026June",null,6,4,30,91,null,{"$f":"IF('Period booking'!$D$10=\"Exit storage\",INDEX(exitstorage,1,1),IF('Period booking'!$D$10=\"Exit non-storage\",INDEX(exit,1,1),IF('Period booking'!$D$10=\"Entry storage\",INDEX(entrystorage,1,1),IF('Period booking'!$D$10=\"Entry Regular\",INDEX(entry,1,1),IF('Period booking'!$D$10=\"Entry LNG\",INDEX(entryLNG,1,1))))))","v":4.94149823},{"$f":"IF('Period booking'!$D$10=\"Exit storage\",INDEX(exitstorage,$G65,2),IF('Period booking'!$D$10=\"Exit non-storage\",INDEX(exit,$G65,2),IF('Period booking'!$D$10=\"Entry storage\",INDEX(entrystorage,$G65,2),IF('Period booking'!$D$10=\"Entry Regular\",INDEX(entry,$G65,2),IF('Period booking'!$D$10=\"Entry LNG\",INDEX(entryLNG,$G65,2))))))","v":1.20735017},{"$f":"IF('Period booking'!$D$10=\"Exit storage\",INDEX(exitstorage,$F65,3),IF('Period booking'!$D$10=\"Exit non-storage\",INDEX(exit,$F65,3),IF('Period booking'!$D$10=\"Entry storage\",INDEX(entrystorage,$F65,3),IF('Period booking'!$D$10=\"Entry Regular\",INDEX(entry,$F65,3),IF('Period booking'!$D$10=\"Entry LNG\",INDEX(entryLNG,$F65,3))))))","v":0.40513516},{"$f":"IF('Period booking'!$D$10=\"Exit storage\",INDEX(exitstorage,$F65,4),IF('Period booking'!$D$10=\"Exit non-storage\",INDEX(exit,$F65,4),IF('Period booking'!$D$10=\"Entry storage\",INDEX(entrystorage,$F65,4),IF('Period booking'!$D$10=\"Entry Regular\",INDEX(entry,$F65,4),IF('Period booking'!$D$10=\"Entry non-storage\",INDEX(entry,1,1),IF('Period booking'!$D$10=\"Entry LNG\",INDEX(entryLNG,$F65,4)))))))","v":0.016300170000000003}]
[null,2026,"July","2026July",null,7,7,31,92,null,{"$f":"IF('Period booking'!$D$10=\"Exit storage\",INDEX(exitstorage,1,1),IF('Period booking'!$D$10=\"Exit non-storage\",INDEX(exit,1,1),IF('Period booking'!$D$10=\"Entry storage\",INDEX(entrystorage,1,1),IF('Period booking'!$D$10=\"Entry Regular\",INDEX(entry,1,1),IF('Period booking'!$D$10=\"Entry LNG\",INDEX(entryLNG,1,1))))))","v":4.94149823},{"$f":"IF('Period booking'!$D$10=\"Exit storage\",INDEX(exitstorage,$G66,2),IF('Period booking'!$D$10=\"Exit non-storage\",INDEX(exit,$G66,2),IF('Period booking'!$D$10=\"Entry storage\",INDEX(entrystorage,$G66,2),IF('Period booking'!$D$10=\"Entry Regular\",INDEX(entry,$G66,2),IF('Period booking'!$D$10=\"Entry LNG\",INDEX(entryLNG,$G66,2))))))","v":0.9792966399999999},{"$f":"IF('Period booking'!$D$10=\"Exit storage\",INDEX(exitstorage,$F66,3),IF('Period booking'!$D$10=\"Exit non-storage\",INDEX(exit,$F66,3),IF('Period booking'!$D$10=\"Entry storage\",INDEX(entrystorage,$F66,3),IF('Period booking'!$D$10=\"Entry Regular\",INDEX(entry,$F66,3),IF('Period booking'!$D$10=\"Entry LNG\",INDEX(entryLNG,$F66,3))))))","v":0.39534693},{"$f":"IF('Period booking'!$D$10=\"Exit storage\",INDEX(exitstorage,$F66,4),IF('Period booking'!$D$10=\"Exit non-storage\",INDEX(exit,$F66,4),IF('Period booking'!$D$10=\"Entry storage\",INDEX(entrystorage,$F66,4),IF('Period booking'!$D$10=\"Entry Regular\",INDEX(entry,$F66,4),IF('Period booking'!$D$10=\"Entry non-storage\",INDEX(entry,1,1),IF('Period booking'!$D$10=\"Entry LNG\",INDEX(entryLNG,$F66,4)))))))","v":0.01537618}]
[null,2026,"August","2026August",null,8,7,31,92,null,{"$f":"IF('Period booking'!$D$10=\"Exit storage\",INDEX(exitstorage,1,1),IF('Period booking'!$D$10=\"Exit non-storage\",INDEX(exit,1,1),IF('Period booking'!$D$10=\"Entry storage\",INDEX(entrystorage,1,1),IF('Period booking'!$D$10=\"Entry Regular\",INDEX(entry,1,1),IF('Period booking'!$D$10=\"Entry LNG\",INDEX(entryLNG,1,1))))))","v":4.94149823},{"$f":"IF('Period booking'!$D$10=\"Exit storage\",INDEX(exitstorage,$G67,2),IF('Period booking'!$D$10=\"Exit non-storage\",INDEX(exit,$G67,2),IF('Period booking'!$D$10=\"Entry storage\",INDEX(entrystorage,$G67,2),IF('Period booking'!$D$10=\"Entry Regular\",INDEX(entry,$G67,2),IF('Period booking'!$D$10=\"Entry LNG\",INDEX(entryLNG,$G67,2))))))","v":0.9792966399999999},{"$f":"IF('Period booking'!$D$10=\"Exit storage\",INDEX(exitstorage,$F67,3),IF('Period booking'!$D$10=\"Exit non-storage\",INDEX(exit,$F67,3),IF('Period booking'!$D$10=\"Entry storage\",INDEX(entrystorage,$F67,3),IF('Period booking'!$D$10=\"Entry Regular\",INDEX(entry,$F67,3),IF('Period booking'!$D$10=\"Entry LNG\",INDEX(entryLNG,$F67,3))))))","v":0.3758314},{"$f":"IF('Period booking'!$D$10=\"Exit storage\",INDEX(exitstorage,$F67,4),IF('Period booking'!$D$10=\"Exit non-storage\",INDEX(exit,$F67,4),IF('Period booking'!$D$10=\"Entry storage\",INDEX(entrystorage,$F67,4),IF('Period booking'!$D$10=\"Entry Regular\",INDEX(entry,$F67,4),IF('Period booking'!$D$10=\"Entry non-storage\",INDEX(entry,1,1),IF('Period booking'!$D$10=\"Entry LNG\",INDEX(entryLNG,$F67,4)))))))","v":0.014641719999999999}]
[null,2026,"September","2026September",null,9,7,30,92,null,{"$f":"IF('Period booking'!$D$10=\"Exit storage\",INDEX(exitstorage,1,1),IF('Period booking'!$D$10=\"Exit non-storage\",INDEX(exit,1,1),IF('Period booking'!$D$10=\"Entry storage\",INDEX(entrystorage,1,1),IF('Period booking'!$D$10=\"Entry Regular\",INDEX(entry,1,1),IF('Period booking'!$D$10=\"Entry LNG\",INDEX(entryLNG,1,1))))))","v":4.94149823},{"$f":"IF('Period booking'!$D$10=\"Exit storage\",INDEX(exitstorage,$G68,2),IF('Period booking'!$D$10=\"Exit non-storage\",INDEX(exit,$G68,2),IF('Period booking'!$D$10=\"Entry storage\",INDEX(entrystorage,$G68,2),IF('Period booking'!$D$10=\"Entry Regular\",INDEX(entry,$G68,2),IF('Period booking'!$D$10=\"Entry LNG\",INDEX(entryLNG,$G68,2))))))","v":0.9792966399999999},{"$f":"IF('Period booking'!$D$10=\"Exit storage\",INDEX(exitstorage,$F68,3),IF('Period booking'!$D$10=\"Exit non-storage\",INDEX(exit,$F68,3),IF('Period booking'!$D$10=\"Entry storage\",INDEX(entrystorage,$F68,3),IF('Period booking'!$D$10=\"Entry Regular\",INDEX(entry,$F68,3),IF('Period booking'!$D$10=\"Entry LNG\",INDEX(entryLNG,$F68,3))))))","v":0.40391671},{"$f":"IF('Period booking'!$D$10=\"Exit storage\",INDEX(exitstorage,$F68,4),IF('Period booking'!$D$10=\"Exit non-storage\",INDEX(exit,$F68,4),IF('Period booking'!$D$10=\"Entry storage\",INDEX(entrystorage,$F68,4),IF('Period booking'!$D$10=\"Entry Regular\",INDEX(entry,$F68,4),IF('Period booking'!$D$10=\"Entry non-storage\",INDEX(entry,1,1),IF('Period booking'!$D$10=\"Entry LNG\",INDEX(entryLNG,$F68,4)))))))","v":0.0162528}]
[null,2026,"October","2026October",null,10,10,31,92,null,{"$f":"IF('Period booking'!$D$10=\"Exit storage\",INDEX(exitstorage,1,1),IF('Period booking'!$D$10=\"Exit non-storage\",INDEX(exit,1,1),IF('Period booking'!$D$10=\"Entry storage\",INDEX(entrystorage,1,1),IF('Period booking'!$D$10=\"Entry Regular\",INDEX(entry,1,1),IF('Period booking'!$D$10=\"Entry LNG\",INDEX(entryLNG,1,1))))))","v":4.94149823},{"$f":"IF('Period booking'!$D$10=\"Exit storage\",INDEX(exitstorage,$G69,2),IF('Period booking'!$D$10=\"Exit non-storage\",INDEX(exit,$G69,2),IF('Period booking'!$D$10=\"Entry storage\",INDEX(entrystorage,$G69,2),IF('Period booking'!$D$10=\"Entry Regular\",INDEX(entry,$G69,2),IF('Period booking'!$D$10=\"Entry LNG\",INDEX(entryLNG,$G69,2))))))","v":1.72038599},{"$f":"IF('Period booking'!$D$10=\"Exit storage\",INDEX(exitstorage,$F69,3),IF('Period booking'!$D$10=\"Exit non-storage\",INDEX(exit,$F69,3),IF('Period booking'!$D$10=\"Entry storage\",INDEX(entrystorage,$F69,3),IF('Period booking'!$D$10=\"Entry Regular\",INDEX(entry,$F69,3),IF('Period booking'!$D$10=\"Entry LNG\",INDEX(entryLNG,$F69,3))))))","v":0.47907487},{"$f":"IF('Period booking'!$D$10=\"Exit storage\",INDEX(exitstorage,$F69,4),IF('Period booking'!$D$10=\"Exit non-storage\",INDEX(exit,$F69,4),IF('Period booking'!$D$10=\"Entry storage\",INDEX(entrystorage,$F69,4),IF('Period booking'!$D$10=\"Entry Regular\",INDEX(entry,$F69,4),IF('Period booking'!$D$10=\"Entry non-storage\",INDEX(entry,1,1),IF('Period booking'!$D$10=\"Entry LNG\",INDEX(entryLNG,$F69,4)))))))","v":0.0186457}]
[null,2026,"November","2026November",null,11,10,30,92,null,{"$f":"IF('Period booking'!$D$10=\"Exit storage\",INDEX(exitstorage,1,1),IF('Period booking'!$D$10=\"Exit non-storage\",INDEX(exit,1,1),IF('Period booking'!$D$10=\"Entry storage\",INDEX(entrystorage,1,1),IF('Period booking'!$D$10=\"Entry Regular\",INDEX(entry,1,1),IF('Period booking'!$D$10=\"Entry LNG\",INDEX(entryLNG,1,1))))))","v":4.94149823},{"$f":"IF('Period booking'!$D$10=\"Exit storage\",INDEX(exitstorage,$G70,2),IF('Period booking'!$D$10=\"Exit non-storage\",INDEX(exit,$G70,2),IF('Period booking'!$D$10=\"Entry storage\",INDEX(entrystorage,$G70,2),IF('Period booking'!$D$10=\"Entry Regular\",INDEX(entry,$G70,2),IF('Period booking'!$D$10=\"Entry LNG\",INDEX(entryLNG,$G70,2))))))","v":1.72038599},{"$f":"IF('Period booking'!$D$10=\"Exit storage\",INDEX(exitstorage,$F70,3),IF('Period booking'!$D$10=\"Exit non-storage\",INDEX(exit,$F70,3),IF('Period booking'!$D$10=\"Entry storage\",INDEX(entrystorage,$F70,3),IF('Period booking'!$D$10=\"Entry Regular\",INDEX(entry,$F70,3),IF('Period booking'!$D$10=\"Entry LNG\",INDEX(entryLNG,$F70,3))))))","v":0.68842517},{"$f":"IF('Period booking'!$D$10=\"Exit storage\",INDEX(exitstorage,$F70,4),IF('Period booking'!$D$10=\"Exit non-storage\",INDEX(exit,$F70,4),IF('Period booking'!$D$10=\"Entry storage\",INDEX(entrystorage,$F70,4),IF('Period booking'!$D$10=\"Entry Regular\",INDEX(entry,$F70,4),IF('Period booking'!$D$10=\"Entry non-storage\",INDEX(entry,1,1),IF('Period booking'!$D$10=\"Entry LNG\",INDEX(entryLNG,$F70,4)))))))","v":0.027672389999999998}]
[null,2026,"December","2026December",null,12,10,31,92,null,{"$f":"IF('Period booking'!$D$10=\"Exit storage\",INDEX(exitstorage,1,1),IF('Period booking'!$D$10=\"Exit non-storage\",INDEX(exit,1,1),IF('Period booking'!$D$10=\"Entry storage\",INDEX(entrystorage,1,1),IF('Period booking'!$D$10=\"Entry Regular\",INDEX(entry,1,1),IF('Period booking'!$D$10=\"Entry LNG\",INDEX(entryLNG,1,1))))))","v":4.94149823},{"$f":"IF('Period booking'!$D$10=\"Exit storage\",INDEX(exitstorage,$G71,2),IF('Period booking'!$D$10=\"Exit non-storage\",INDEX(exit,$G71,2),IF('Period booking'!$D$10=\"Entry storage\",INDEX(entrystorage,$G71,2),IF('Period booking'!$D$10=\"Entry Regular\",INDEX(entry,$G71,2),IF('Period booking'!$D$10=\"Entry LNG\",INDEX(entryLNG,$G71,2))))))","v":1.72038599},{"$f":"IF('Period booking'!$D$10=\"Exit storage\",INDEX(exitstorage,$F71,3),IF('Period booking'!$D$10=\"Exit non-storage\",INDEX(exit,$F71,3),IF('Period booking'!$D$10=\"Entry storage\",INDEX(entrystorage,$F71,3),IF('Period booking'!$D$10=\"Entry Regular\",INDEX(entry,$F71,3),IF('Period booking'!$D$10=\"Entry LNG\",INDEX(entryLNG,$F71,3))))))","v":0.89645547},{"$f":"IF('Period booking'!$D$10=\"Exit storage\",INDEX(exitstorage,$F71,4),IF('Period booking'!$D$10=\"Exit non-storage\",INDEX(exit,$F71,4),IF('Period booking'!$D$10=\"Entry storage\",INDEX(entrystorage,$F71,4),IF('Period booking'!$D$10=\"Entry Regular\",INDEX(entry,$F71,4),IF('Period booking'!$D$10=\"Entry non-storage\",INDEX(entry,1,1),IF('Period booking'!$D$10=\"Entry LNG\",INDEX(entryLNG,$F71,4)))))))","v":0.03487479}]
[null,{"$f":"YEAR(L$8+366)","v":2027},"January","2027January",null,1,1,31,90,null,{"$f":"IF('Period booking'!$D$10=\"Exit storage\",INDEX(exitstorage,1,1),IF('Period booking'!$D$10=\"Exit non-storage\",INDEX(exit,1,1),IF('Period booking'!$D$10=\"Entry storage\",INDEX(entrystorage,1,1),IF('Period booking'!$D$10=\"Entry Regular\",INDEX(entry,1,1),IF('Period booking'!$D$10=\"Entry LNG\",INDEX(entryLNG,1,1))))))","v":4.94149823},{"$f":"IF('Period booking'!$D$10=\"Exit storage\",INDEX(exitstorage,$G72,2),IF('Period booking'!$D$10=\"Exit non-storage\",INDEX(exit,$G72,2),IF('Period booking'!$D$10=\"Entry storage\",INDEX(entrystorage,$G72,2),IF('Period booking'!$D$10=\"Entry Regular\",INDEX(entry,$G72,2),IF('Period booking'!$D$10=\"Entry LNG\",INDEX(entryLNG,$G72,2))))))","v":2.25718162},{"$f":"IF('Period booking'!$D$10=\"Exit storage\",INDEX(exitstorage,$F72,3),IF('Period booking'!$D$10=\"Exit non-storage\",INDEX(exit,$F72,3),IF('Period booking'!$D$10=\"Entry storage\",INDEX(entrystorage,$F72,3),IF('Period booking'!$D$10=\"Entry Regular\",INDEX(entry,$F72,3),IF('Period booking'!$D$10=\"Entry LNG\",INDEX(entryLNG,$F72,3))))))","v":1.07964967},{"$f":"IF('Period booking'!$D$10=\"Exit storage\",INDEX(exitstorage,$F72,4),IF('Period booking'!$D$10=\"Exit non-storage\",INDEX(exit,$F72,4),IF('Period booking'!$D$10=\"Entry storage\",INDEX(entrystorage,$F72,4),IF('Period booking'!$D$10=\"Entry Regular\",INDEX(entry,$F72,4),IF('Period booking'!$D$10=\"Entry non-storage\",INDEX(entry,1,1),IF('Period booking'!$D$10=\"Entry LNG\",INDEX(entryLNG,$F72,4)))))))","v":0.04200612}]
[null,2027,"February","2027February",null,2,1,28,90,null,{"$f":"IF('Period booking'!$D$10=\"Exit storage\",INDEX(exitstorage,1,1),IF('Period booking'!$D$10=\"Exit non-storage\",INDEX(exit,1,1),IF('Period booking'!$D$10=\"Entry storage\",INDEX(entrystorage,1,1),IF('Period booking'!$D$10=\"Entry Regular\",INDEX(entry,1,1),IF('Period booking'!$D$10=\"Entry LNG\",INDEX(entryLNG,1,1))))))","v":4.94149823},{"$f":"IF('Period booking'!$D$10=\"Exit storage\",INDEX(exitstorage,$G73,2),IF('Period booking'!$D$10=\"Exit non-storage\",INDEX(exit,$G73,2),IF('Period booking'!$D$10=\"Entry storage\",INDEX(entrystorage,$G73,2),IF('Period booking'!$D$10=\"Entry Regular\",INDEX(entry,$G73,2),IF('Period booking'!$D$10=\"Entry LNG\",INDEX(entryLNG,$G73,2))))))","v":2.25718162},{"$f":"IF('Period booking'!$D$10=\"Exit storage\",INDEX(exitstorage,$F73,3),IF('Period booking'!$D$10=\"Exit non-storage\",INDEX(exit,$F73,3),IF('Period booking'!$D$10=\"Entry storage\",INDEX(entrystorage,$F73,3),IF('Period booking'!$D$10=\"Entry Regular\",INDEX(entry,$F73,3),IF('Period booking'!$D$10=\"Entry LNG\",INDEX(entryLNG,$F73,3))))))","v":0.87168029},{"$f":"IF('Period booking'!$D$10=\"Exit storage\",INDEX(exitstorage,$F73,4),IF('Period booking'!$D$10=\"Exit non-storage\",INDEX(exit,$F73,4),IF('Period booking'!$D$10=\"Entry storage\",INDEX(entrystorage,$F73,4),IF('Period booking'!$D$10=\"Entry Regular\",INDEX(entry,$F73,4),IF('Period booking'!$D$10=\"Entry non-storage\",INDEX(entry,1,1),IF('Period booking'!$D$10=\"Entry LNG\",INDEX(entryLNG,$F73,4)))))))","v":0.037552}]
[null,2027,"March","2027March",null,3,1,31,90,null,{"$f":"IF('Period booking'!$D$10=\"Exit storage\",INDEX(exitstorage,1,1),IF('Period booking'!$D$10=\"Exit non-storage\",INDEX(exit,1,1),IF('Period booking'!$D$10=\"Entry storage\",INDEX(entrystorage,1,1),IF('Period booking'!$D$10=\"Entry Regular\",INDEX(entry,1,1),IF('Period booking'!$D$10=\"Entry LNG\",INDEX(entryLNG,1,1))))))","v":4.94149823},{"$f":"IF('Period booking'!$D$10=\"Exit storage\",INDEX(exitstorage,$G74,2),IF('Period booking'!$D$10=\"Exit non-storage\",INDEX(exit,$G74,2),IF('Period booking'!$D$10=\"Entry storage\",INDEX(entrystorage,$G74,2),IF('Period booking'!$D$10=\"Entry Regular\",INDEX(entry,$G74,2),IF('Period booking'!$D$10=\"Entry LNG\",INDEX(entryLNG,$G74,2))))))","v":2.25718162},{"$f":"IF('Period booking'!$D$10=\"Exit storage\",INDEX(exitstorage,$F74,3),IF('Period booking'!$D$10=\"Exit non-storage\",INDEX(exit,$F74,3),IF('Period booking'!$D$10=\"Entry storage\",INDEX(entrystorage,$F74,3),IF('Period booking'!$D$10=\"Entry Regular\",INDEX(entry,$F74,3),IF('Period booking'!$D$10=\"Entry LNG\",INDEX(entryLNG,$F74,3))))))","v":0.75481047},{"$f":"IF('Period booking'!$D$10=\"Exit storage\",INDEX(exitstorage,$F74,4),IF('Period booking'!$D$10=\"Exit non-storage\",INDEX(exit,$F74,4),IF('Period booking'!$D$10=\"Entry storage\",INDEX(entrystorage,$F74,4),IF('Period booking'!$D$10=\"Entry Regular\",INDEX(entry,$F74,4),IF('Period booking'!$D$10=\"Entry non-storage\",INDEX(entry,1,1),IF('Period booking'!$D$10=\"Entry LNG\",INDEX(entryLNG,$F74,4)))))))","v":0.02935453}]
[null,2027,"April","2027April",null,4,4,30,91,null,{"$f":"IF('Period booking'!$D$10=\"Exit storage\",INDEX(exitstorage,1,1),IF('Period booking'!$D$10=\"Exit non-storage\",INDEX(exit,1,1),IF('Period booking'!$D$10=\"Entry storage\",INDEX(entrystorage,1,1),IF('Period booking'!$D$10=\"Entry Regular\",INDEX(entry,1,1),IF('Period booking'!$D$10=\"Entry LNG\",INDEX(entryLNG,1,1))))))","v":4.94149823},{"$f":"IF('Period booking'!$D$10=\"Exit storage\",INDEX(exitstorage,$G75,2),IF('Period booking'!$D$10=\"Exit non-storage\",INDEX(exit,$G75,2),IF('Period booking'!$D$10=\"Entry storage\",INDEX(entrystorage,$G75,2),IF('Period booking'!$D$10=\"Entry Regular\",INDEX(entry,$G75,2),IF('Period booking'!$D$10=\"Entry LNG\",INDEX(entryLNG,$G75,2))))))","v":1.20735017},{"$f":"IF('Period booking'!$D$10=\"Exit storage\",INDEX(exitstorage,$F75,3),IF('Period booking'!$D$10=\"Exit non-storage\",INDEX(exit,$F75,3),IF('Period booking'!$D$10=\"Entry storage\",INDEX(entrystorage,$F75,3),IF('Period booking'!$D$10=\"Entry Regular\",INDEX(entry,$F75,3),IF('Period booking'!$D$10=\"Entry LNG\",INDEX(entryLNG,$F75,3))))))","v":0.54464787},{"$f":"IF('Period booking'!$D$10=\"Exit storage\",INDEX(exitstorage,$F75,4),IF('Period booking'!$D$10=\"Exit non-storage\",INDEX(exit,$F75,4),IF('Period booking'!$D$10=\"Entry storage\",INDEX(entrystorage,$F75,4),IF('Period booking'!$D$10=\"Entry Regular\",INDEX(entry,$F75,4),IF('Period booking'!$D$10=\"Entry non-storage\",INDEX(entry,1,1),IF('Period booking'!$D$10=\"Entry LNG\",INDEX(entryLNG,$F75,4)))))))","v":0.021891519999999998}]
[null,2027,"May","2027May",null,5,4,31,91,null,{"$f":"IF('Period booking'!$D$10=\"Exit storage\",INDEX(exitstorage,1,1),IF('Period booking'!$D$10=\"Exit non-storage\",INDEX(exit,1,1),IF('Period booking'!$D$10=\"Entry storage\",INDEX(entrystorage,1,1),IF('Period booking'!$D$10=\"Entry Regular\",INDEX(entry,1,1),IF('Period booking'!$D$10=\"Entry LNG\",INDEX(entryLNG,1,1))))))","v":4.94149823},{"$f":"IF('Period booking'!$D$10=\"Exit storage\",INDEX(exitstorage,$G76,2),IF('Period booking'!$D$10=\"Exit non-storage\",INDEX(exit,$G76,2),IF('Period booking'!$D$10=\"Entry storage\",INDEX(entrystorage,$G76,2),IF('Period booking'!$D$10=\"Entry Regular\",INDEX(entry,$G76,2),IF('Period booking'!$D$10=\"Entry LNG\",INDEX(entryLNG,$G76,2))))))","v":1.20735017},{"$f":"IF('Period booking'!$D$10=\"Exit storage\",INDEX(exitstorage,$F76,3),IF('Period booking'!$D$10=\"Exit non-storage\",INDEX(exit,$F76,3),IF('Period booking'!$D$10=\"Entry storage\",INDEX(entrystorage,$F76,3),IF('Period booking'!$D$10=\"Entry Regular\",INDEX(entry,$F76,3),IF('Period booking'!$D$10=\"Entry LNG\",INDEX(entryLNG,$F76,3))))))","v":0.4985904},{"$f":"IF('Period booking'!$D$10=\"Exit storage\",INDEX(exitstorage,$F76,4),IF('Period booking'!$D$10=\"Exit non-storage\",INDEX(exit,$F76,4),IF('Period booking'!$D$10=\"Entry storage\",INDEX(entrystorage,$F76,4),IF('Period booking'!$D$10=\"Entry Regular\",INDEX(entry,$F76,4),IF('Period booking'!$D$10=\"Entry non-storage\",INDEX(entry,1,1),IF('Period booking'!$D$10=\"Entry LNG\",INDEX(entryLNG,$F76,4)))))))","v":0.01940385}]
[null,2027,"June","2027June",null,6,4,30,91,null,{"$f":"IF('Period booking'!$D$10=\"Exit storage\",INDEX(exitstorage,1,1),IF('Period booking'!$D$10=\"Exit non-storage\",INDEX(exit,1,1),IF('Period booking'!$D$10=\"Entry storage\",INDEX(entrystorage,1,1),IF('Period booking'!$D$10=\"Entry Regular\",INDEX(entry,1,1),IF('Period booking'!$D$10=\"Entry LNG\",INDEX(entryLNG,1,1))))))","v":4.94149823},{"$f":"IF('Period booking'!$D$10=\"Exit storage\",INDEX(exitstorage,$G77,2),IF('Period booking'!$D$10=\"Exit non-storage\",INDEX(exit,$G77,2),IF('Period booking'!$D$10=\"Entry storage\",INDEX(entrystorage,$G77,2),IF('Period booking'!$D$10=\"Entry Regular\",INDEX(entry,$G77,2),IF('Period booking'!$D$10=\"Entry LNG\",INDEX(entryLNG,$G77,2))))))","v":1.20735017},{"$f":"IF('Period booking'!$D$10=\"Exit storage\",INDEX(exitstorage,$F77,3),IF('Period booking'!$D$10=\"Exit non-storage\",INDEX(exit,$F77,3),IF('Period booking'!$D$10=\"Entry storage\",INDEX(entrystorage,$F77,3),IF('Period booking'!$D$10=\"Entry Regular\",INDEX(entry,$F77,3),IF('Period booking'!$D$10=\"Entry LNG\",INDEX(entryLNG,$F77,3))))))","v":0.40513516},{"$f":"IF('Period booking'!$D$10=\"Exit storage\",INDEX(exitstorage,$F77,4),IF('Period booking'!$D$10=\"Exit non-storage\",INDEX(exit,$F77,4),IF('Period booking'!$D$10=\"Entry storage\",INDEX(entrystorage,$F77,4),IF('Period booking'!$D$10=\"Entry Regular\",INDEX(entry,$F77,4),IF('Period booking'!$D$10=\"Entry non-storage\",INDEX(entry,1,1),IF('Period booking'!$D$10=\"Entry LNG\",INDEX(entryLNG,$F77,4)))))))","v":0.016300170000000003}]
[null,2027,"July","2027July",null,7,7,31,92,null,{"$f":"IF('Period booking'!$D$10=\"Exit storage\",INDEX(exitstorage,1,1),IF('Period booking'!$D$10=\"Exit non-storage\",INDEX(exit,1,1),IF('Period booking'!$D$10=\"Entry storage\",INDEX(entrystorage,1,1),IF('Period booking'!$D$10=\"Entry Regular\",INDEX(entry,1,1),IF('Period booking'!$D$10=\"Entry LNG\",INDEX(entryLNG,1,1))))))","v":4.94149823},{"$f":"IF('Period booking'!$D$10=\"Exit storage\",INDEX(exitstorage,$G78,2),IF('Period booking'!$D$10=\"Exit non-storage\",INDEX(exit,$G78,2),IF('Period booking'!$D$10=\"Entry storage\",INDEX(entrystorage,$G78,2),IF('Period booking'!$D$10=\"Entry Regular\",INDEX(entry,$G78,2),IF('Period booking'!$D$10=\"Entry LNG\",INDEX(entryLNG,$G78,2))))))","v":0.9792966399999999},{"$f":"IF('Period booking'!$D$10=\"Exit storage\",INDEX(exitstorage,$F78,3),IF('Period booking'!$D$10=\"Exit non-storage\",INDEX(exit,$F78,3),IF('Period booking'!$D$10=\"Entry storage\",INDEX(entrystorage,$F78,3),IF('Period booking'!$D$10=\"Entry Regular\",INDEX(entry,$F78,3),IF('Period booking'!$D$10=\"Entry LNG\",INDEX(entryLNG,$F78,3))))))","v":0.39534693},{"$f":"IF('Period booking'!$D$10=\"Exit storage\",INDEX(exitstorage,$F78,4),IF('Period booking'!$D$10=\"Exit non-storage\",INDEX(exit,$F78,4),IF('Period booking'!$D$10=\"Entry storage\",INDEX(entrystorage,$F78,4),IF('Period booking'!$D$10=\"Entry Regular\",INDEX(entry,$F78,4),IF('Period booking'!$D$10=\"Entry non-storage\",INDEX(entry,1,1),IF('Period booking'!$D$10=\"Entry LNG\",INDEX(entryLNG,$F78,4)))))))","v":0.01537618}]
[null,2027,"August","2027August",null,8,7,31,92,null,{"$f":"IF('Period booking'!$D$10=\"Exit storage\",INDEX(exitstorage,1,1),IF('Period booking'!$D$10=\"Exit non-storage\",INDEX(exit,1,1),IF('Period booking'!$D$10=\"Entry storage\",INDEX(entrystorage,1,1),IF('Period booking'!$D$10=\"Entry Regular\",INDEX(entry,1,1),IF('Period booking'!$D$10=\"Entry LNG\",INDEX(entryLNG,1,1))))))","v":4.94149823},{"$f":"IF('Period booking'!$D$10=\"Exit storage\",INDEX(exitstorage,$G79,2),IF('Period booking'!$D$10=\"Exit non-storage\",INDEX(exit,$G79,2),IF('Period booking'!$D$10=\"Entry storage\",INDEX(entrystorage,$G79,2),IF('Period booking'!$D$10=\"Entry Regular\",INDEX(entry,$G79,2),IF('Period booking'!$D$10=\"Entry LNG\",INDEX(entryLNG,$G79,2))))))","v":0.9792966399999999},{"$f":"IF('Period booking'!$D$10=\"Exit storage\",INDEX(exitstorage,$F79,3),IF('Period booking'!$D$10=\"Exit non-storage\",INDEX(exit,$F79,3),IF('Period booking'!$D$10=\"Entry storage\",INDEX(entrystorage,$F79,3),IF('Period booking'!$D$10=\"Entry Regular\",INDEX(entry,$F79,3),IF('Period booking'!$D$10=\"Entry LNG\",INDEX(entryLNG,$F79,3))))))","v":0.3758314},{"$f":"IF('Period booking'!$D$10=\"Exit storage\",INDEX(exitstorage,$F79,4),IF('Period booking'!$D$10=\"Exit non-storage\",INDEX(exit,$F79,4),IF('Period booking'!$D$10=\"Entry storage\",INDEX(entrystorage,$F79,4),IF('Period booking'!$D$10=\"Entry Regular\",INDEX(entry,$F79,4),IF('Period booking'!$D$10=\"Entry non-storage\",INDEX(entry,1,1),IF('Period booking'!$D$10=\"Entry LNG\",INDEX(entryLNG,$F79,4)))))))","v":0.014641719999999999}]
[null,2027,"September","2027September",null,9,7,30,92,null,{"$f":"IF('Period booking'!$D$10=\"Exit storage\",INDEX(exitstorage,1,1),IF('Period booking'!$D$10=\"Exit non-storage\",INDEX(exit,1,1),IF('Period booking'!$D$10=\"Entry storage\",INDEX(entrystorage,1,1),IF('Period booking'!$D$10=\"Entry Regular\",INDEX(entry,1,1),IF('Period booking'!$D$10=\"Entry LNG\",INDEX(entryLNG,1,1))))))","v":4.94149823},{"$f":"IF('Period booking'!$D$10=\"Exit storage\",INDEX(exitstorage,$G80,2),IF('Period booking'!$D$10=\"Exit non-storage\",INDEX(exit,$G80,2),IF('Period booking'!$D$10=\"Entry storage\",INDEX(entrystorage,$G80,2),IF('Period booking'!$D$10=\"Entry Regular\",INDEX(entry,$G80,2),IF('Period booking'!$D$10=\"Entry LNG\",INDEX(entryLNG,$G80,2))))))","v":0.9792966399999999},{"$f":"IF('Period booking'!$D$10=\"Exit storage\",INDEX(exitstorage,$F80,3),IF('Period booking'!$D$10=\"Exit non-storage\",INDEX(exit,$F80,3),IF('Period booking'!$D$10=\"Entry storage\",INDEX(entrystorage,$F80,3),IF('Period booking'!$D$10=\"Entry Regular\",INDEX(entry,$F80,3),IF('Period booking'!$D$10=\"Entry LNG\",INDEX(entryLNG,$F80,3))))))","v":0.40391671},{"$f":"IF('Period booking'!$D$10=\"Exit storage\",INDEX(exitstorage,$F80,4),IF('Period booking'!$D$10=\"Exit non-storage\",INDEX(exit,$F80,4),IF('Period booking'!$D$10=\"Entry storage\",INDEX(entrystorage,$F80,4),IF('Period booking'!$D$10=\"Entry Regular\",INDEX(entry,$F80,4),IF('Period booking'!$D$10=\"Entry non-storage\",INDEX(entry,1,1),IF('Period booking'!$D$10=\"Entry LNG\",INDEX(entryLNG,$F80,4)))))))","v":0.0162528}]
[null,2027,"October","2027October",null,10,10,31,92,null,{"$f":"IF('Period booking'!$D$10=\"Exit storage\",INDEX(exitstorage,1,1),IF('Period booking'!$D$10=\"Exit non-storage\",INDEX(exit,1,1),IF('Period booking'!$D$10=\"Entry storage\",INDEX(entrystorage,1,1),IF('Period booking'!$D$10=\"Entry Regular\",INDEX(entry,1,1),IF('Period booking'!$D$10=\"Entry LNG\",INDEX(entryLNG,1,1))))))","v":4.94149823},{"$f":"IF('Period booking'!$D$10=\"Exit storage\",INDEX(exitstorage,$G81,2),IF('Period booking'!$D$10=\"Exit non-storage\",INDEX(exit,$G81,2),IF('Period booking'!$D$10=\"Entry storage\",INDEX(entrystorage,$G81,2),IF('Period booking'!$D$10=\"Entry Regular\",INDEX(entry,$G81,2),IF('Period booking'!$D$10=\"Entry LNG\",INDEX(entryLNG,$G81,2))))))","v":1.72038599},{"$f":"IF('Period booking'!$D$10=\"Exit storage\",INDEX(exitstorage,$F81,3),IF('Period booking'!$D$10=\"Exit non-storage\",INDEX(exit,$F81,3),IF('Period booking'!$D$10=\"Entry storage\",INDEX(entrystorage,$F81,3),IF('Period booking'!$D$10=\"Entry Regular\",INDEX(entry,$F81,3),IF('Period booking'!$D$10=\"Entry LNG\",INDEX(entryLNG,$F81,3))))))","v":0.47907487},{"$f":"IF('Period booking'!$D$10=\"Exit storage\",INDEX(exitstorage,$F81,4),IF('Period booking'!$D$10=\"Exit non-storage\",INDEX(exit,$F81,4),IF('Period booking'!$D$10=\"Entry storage\",INDEX(entrystorage,$F81,4),IF('Period booking'!$D$10=\"Entry Regular\",INDEX(entry,$F81,4),IF('Period booking'!$D$10=\"Entry non-storage\",INDEX(entry,1,1),IF('Period booking'!$D$10=\"Entry LNG\",INDEX(entryLNG,$F81,4)))))))","v":0.0186457}]
[null,2027,"November","2027November",null,11,10,30,{"$f":"IF(G82<>G81,SUM(F84:F84),I81)","v":92},null,{"$f":"IF('Period booking'!$D$10=\"Exit storage\",INDEX(exitstorage,1,1),IF('Period booking'!$D$10=\"Exit non-storage\",INDEX(exit,1,1),IF('Period booking'!$D$10=\"Entry storage\",INDEX(entrystorage,1,1),IF('Period booking'!$D$10=\"Entry Regular\",INDEX(entry,1,1),IF('Period booking'!$D$10=\"Entry LNG\",INDEX(entryLNG,1,1))))))","v":4.94149823},{"$f":"IF('Period booking'!$D$10=\"Exit storage\",INDEX(exitstorage,$G82,2),IF('Period booking'!$D$10=\"Exit non-storage\",INDEX(exit,$G82,2),IF('Period booking'!$D$10=\"Entry storage\",INDEX(entrystorage,$G82,2),IF('Period booking'!$D$10=\"Entry Regular\",INDEX(entry,$G82,2),IF('Period booking'!$D$10=\"Entry LNG\",INDEX(entryLNG,$G82,2))))))","v":1.72038599},{"$f":"IF('Period booking'!$D$10=\"Exit storage\",INDEX(exitstorage,$F82,3),IF('Period booking'!$D$10=\"Exit non-storage\",INDEX(exit,$F82,3),IF('Period booking'!$D$10=\"Entry storage\",INDEX(entrystorage,$F82,3),IF('Period booking'!$D$10=\"Entry Regular\",INDEX(entry,$F82,3),IF('Period booking'!$D$10=\"Entry LNG\",INDEX(entryLNG,$F82,3))))))","v":0.68842517},{"$f":"IF('Period booking'!$D$10=\"Exit storage\",INDEX(exitstorage,$F82,4),IF('Period booking'!$D$10=\"Exit non-storage\",INDEX(exit,$F82,4),IF('Period booking'!$D$10=\"Entry storage\",INDEX(entrystorage,$F82,4),IF('Period booking'!$D$10=\"Entry Regular\",INDEX(entry,$F82,4),IF('Period booking'!$D$10=\"Entry non-storage\",INDEX(entry,1,1),IF('Period booking'!$D$10=\"Entry LNG\",INDEX(entryLNG,$F82,4)))))))","v":0.027672389999999998}]
[null,2027,"December","2027December",null,12,10,31,{"$f":"IF(G83<>G82,SUM(F84:F85),I82)","v":92},null,{"$f":"IF('Period booking'!$D$10=\"Exit storage\",INDEX(exitstorage,1,1),IF('Period booking'!$D$10=\"Exit non-storage\",INDEX(exit,1,1),IF('Period booking'!$D$10=\"Entry storage\",INDEX(entrystorage,1,1),IF('Period booking'!$D$10=\"Entry Regular\",INDEX(entry,1,1),IF('Period booking'!$D$10=\"Entry LNG\",INDEX(entryLNG,1,1))))))","v":4.94149823},{"$f":"IF('Period booking'!$D$10=\"Exit storage\",INDEX(exitstorage,$G83,2),IF('Period booking'!$D$10=\"Exit non-storage\",INDEX(exit,$G83,2),IF('Period booking'!$D$10=\"Entry storage\",INDEX(entrystorage,$G83,2),IF('Period booking'!$D$10=\"Entry Regular\",INDEX(entry,$G83,2),IF('Period booking'!$D$10=\"Entry LNG\",INDEX(entryLNG,$G83,2))))))","v":1.72038599},{"$f":"IF('Period booking'!$D$10=\"Exit storage\",INDEX(exitstorage,$F83,3),IF('Period booking'!$D$10=\"Exit non-storage\",INDEX(exit,$F83,3),IF('Period booking'!$D$10=\"Entry storage\",INDEX(entrystorage,$F83,3),IF('Period booking'!$D$10=\"Entry Regular\",INDEX(entry,$F83,3),IF('Period booking'!$D$10=\"Entry LNG\",INDEX(entryLNG,$F83,3))))))","v":0.89645547},{"$f":"IF('Period booking'!$D$10=\"Exit storage\",INDEX(exitstorage,$F83,4),IF('Period booking'!$D$10=\"Exit non-storage\",INDEX(exit,$F83,4),IF('Period booking'!$D$10=\"Entry storage\",INDEX(entrystorage,$F83,4),IF('Period booking'!$D$10=\"Entry Regular\",INDEX(entry,$F83,4),IF('Period booking'!$D$10=\"Entry non-storage\",INDEX(entry,1,1),IF('Period booking'!$D$10=\"Entry LNG\",INDEX(entryLNG,$F83,4)))))))","v":0.03487479}]

{"sheet":"Multipliers and SF","index":6,"n_rows":31,"n_cols":6,"rows_kept":31,"hidden":true}
[]
[]
[]
[null,"MULTIPLIERS AND SEASONAL FACTORS"]
[]
[null,"Multipliers (M)"]
[]
[null,"Quarterly multiplier","M-Q",1.25]
[null,"Monthly multiplier","M-M",1.5]
[null,"Daily multiplier","M-DA",1.75]
[null,"Within-day multiplier","M-WID",1.75]
[]
[null,"Seasonal factors (SF)",null,"Month","Day","WID"]
[]
[null,"SF - Jan",null,1.715,1.773,1.773]
[null,"SF - Feb",null,1.533,1.585,1.585]
[null,"SF - March",null,1.199,1.239,1.239]
[null,"SF - April",null,0.894,0.924,0.924]
[null,"SF - May",null,0.792,0.819,0.819]
[null,"SF - June",null,0.665,0.688,0.688]
[null,"SF - July",null,0.628,0.649,0.649]
[null,"SF - August",null,0.597,0.618,0.618]
[null,"SF - Sept",null,0.663,0.686,0.686]
[null,"SF - Oct",null,0.761,0.787,0.787]
[null,"SF - Nov",null,{"v":1.13,"d":"1.130"},1.168,1.168]
[null,"SF - Dec",null,1.424,1.472,1.472]
[]
[null,"SF - Jan - March",null,1.482]
[null,"SF - April - June",null,0.784]
[null,"SF - July - Sept",null,0.629]
[null,"SF - Oct - Dec",null,1.105]

{"sheet":"Validation","index":7,"n_rows":15,"n_cols":3,"rows_kept":15,"hidden":true}
[]
[]
[]
[null,"VALIDATION POSTAGE STAMP POINTS"]
[]
[null,null,"Entry Regular"]
[null,null,"Entry Storage"]
[null,null,"Entry LNG"]
[null,null,"Exit non-storage"]
[null,null,"Exit storage"]
[]
[null,"VALIDATION FEBRUARY IN LEAP YEAR"]
[]
[null,null,"Yes"]
[null,null,"No"]