{"text_format":"3","workbook":"xlsx","n_sheets":8,"sheets":["EXPLANATION","Period booking","Total prices","Transmission tariffs","Neutrality charge","Optimalisation","Multipliers and SF","Validation"],"not_rendered":{"images":9,"macros":1,"defined_names":5},"read":"whole","date_system":"1900"}

{"sheet":"EXPLANATION","index":0,"n_rows":66,"n_cols":9,"rows_kept":66,"merged":[[16,1,16,2],[17,1,17,2],[18,1,18,2],[19,1,19,2],[20,1,20,2],[25,1,27,10],[29,1,32,10],[34,2,36,10],[38,2,40,10],[42,2,44,10],[48,2,48,10],[50,2,51,10],[53,2,54,10],[56,2,58,10],[61,1,62,10],[65,1,67,10]]}
[]
[]
[]
[null,"DISCLAIMER"]
[]
[null,"- GTS only provide's this file as service, no rights whatsoever may be derived from these calculations, shipper' bookings and GTS Invoices are leading."]
[null,"- Tariffs used in the calculation are the total prices for 2026"]
[null,"- Total price is the sum of the all-in transmission tariff and the neutrality charge, whereby:"]
[null,"- transmission tariffs for 2026 are established by the Dutch regulator ACM (26 May 2025)"]
[null,"- neutrality charges for 2026 are established by GTS in accordance with the calculation methodology as stated in de Transmission Code Gas TSO"]
[null,null,"https://www.gasunietransportservices.nl/en/news/tariff-decision-2026"]
[null,"- Multipliers and seasonal factors used as established by the Duth regulator ACM in the NC TAR decision (25 April 2024):"]
[null,null,"https://www.acm.nl/nl/publicaties/codebesluit-ter-uitvoering-van-nc-tar",{"$nulls":5},"(Dutch)"]
[]
[null,"LEGEND"]
[]
[null,"GREEN",null,null,"Input cells to be filled out by user"]
[null,"BLUE",null,null,"Fixed input data"]
[null,"YELLOW",null,null,"Calculated value "]
[null,"ORANGE",null,null,"Calculated resulting value"]
{"$rows_left_out":47}
{"sheet":"Period booking","index":1,"n_rows":42,"n_cols":8,"rows_kept":42,"merged":[[3,1,4,10],[12,1,12,7],[17,13,17,14]]}
[]
[]
[]
[null,"CALCULATION TOOL FOR OPTIMISATION OF PERIOD BOOKINGS INTO (Y, Q, M, DA) FIRM CAPACITY PRODUCTS"]
[]
[null,"Please fill in the appropriate values in the GREEN fields and find the optimalisation results below"]
[]
[null,"Start date",{"$f":"IF(OR(ISERROR(DAY($D$8)),ISERROR(DAY($D$9))),1,IF(OR($D$9<$D$8,$D$9>$D$8+366,$D$11<0),1,0))","v":0},"2026-01-01",{"$f":"IF(OR(ISERROR(DAY($D$8)),ISERROR(DAY($D$9))),\"WARNING: calculation not reliable due to incorrect start or end date; please correct!\",IF(D9<D8,\"WARNING: calculation not reliable due to incorrect start and end date (start date NOT before end date); please correct!\",IF(D9>D8+366,\" WARNING: calculation not reliable due to incorrect start and end date (period > 1 year), please correct!\",\"\")))","v":""}]
[null,"End date (including)",null,"2026-12-31",{"$f":"IF(Optimalisation!$T$53=11,\"REMARK: for this period a yearly booking is cheaper; please add 12th month to period for monthly cost estimate!\",IF(Optimalisation!$T$53=10,\"REMARK: for this period a yearly booking is cheaper; please add 11th and 12th month to period for monthly cost estimate!\",IF(Optimalisation!$T$53=9,\"REMARK: for this period a yearly booking is cheaper; please add 10th, 11th and 12th month to period for monthly cost estimate!\",\"\")))","v":""}]
[null,"Postage stamp point",null,"Exit non-storage","For all dates/periods, the prices used in the calculation tool are the total prices 2026 (see sheet 'Explanation')"]
[null,"Quantity ","kWh/h",{"v":100000,"d":"100,000"},{"$f":"IF(D11<0,\"WARNING: quantity is negative, please correct to positive value!\",\"\")","v":""}]
[]
[null,"PERIOD BOOKING CONVERTED INTO OPTIMISED COMBINATION OF Y, Q, M, DA CAPACITY PRODUCTS"]
[]
[null,"Month","Year","Yearly capacity booking","Quarterly capacity booking","Monthly capacity booking","Daily capacity \nbooking","Cost/month\nbased on 2026 tariffs"]
[{"$nulls":3},"kWh/h","kWh/h","kWh/h","kWh/h","EUR"]
[]
[{"$nulls":6},"Total cost:",{"$f":"SUM(H19:H42)","v":{"v":494149.82299999986,"d":"€ 494,150"}}]
[null,"January",{"$f":"IF($C$8=1,\"\",YEAR(D$8))","v":2026},{"$f":"IF($C$8=1,\"\",Optimalisation!Y29)","v":"Y"},{"$f":"IF($C$8=1,\"\",Optimalisation!Z29)","v":""},{"$f":"IF($C$8=1,\"\",Optimalisation!AA29)","v":""},{"$f":"IF($C$8=1,\"\",Optimalisation!AB29)","v":""},{"$f":"IF($C$8=1,\"\",Optimalisation!X29)","v":{"v":41968.88907671232,"d":"€ 41,969"}}]
[null,"February",{"$f":"IF($C$8=1,\"\",YEAR(D$8))","v":2026},{"$f":"IF($C$8=1,\"\",Optimalisation!Y30)","v":"Y"},{"$f":"IF($C$8=1,\"\",Optimalisation!Z30)","v":""},{"$f":"IF($C$8=1,\"\",Optimalisation!AA30)","v":""},{"$f":"IF($C$8=1,\"\",Optimalisation!AB30)","v":""},{"$f":"IF($C$8=1,\"\",Optimalisation!X30)","v":{"v":37907.38368219177,"d":"€ 37,907"}}]
{"$rows_left_out":23}
{"sheet":"Total prices","index":2,"n_rows":42,"n_cols":19,"rows_kept":42,"merged":[[7,2,7,6],[7,8,7,12],[7,14,7,18],[12,2,23,2],[12,3,14,3],[12,8,23,8],[12,9,14,9],[12,14,23,14],[12,15,14,15],[15,3,17,3],[15,9,17,9],[15,15,17,15],[18,3,20,3],[18,9,20,9],[18,15,20,15],[21,3,23,3],[21,9,23,9],[21,15,23,15],[25,2,25,6],[25,8,25,12],[30,2,41,2],[30,3,32,3],[30,8,41,8],[30,9,32,9],[33,3,35,3],[33,9,35,9],[36,3,38,3],[36,9,38,9],[39,3,41,3],[39,9,41,9]]}
[]
[]
[]
[null,"TOTAL PRICES 2026 FIRM CAPACITY (which is sum of the all-in transmission tariffs and the neutrality charges)"]
[]
[]
[]
[null,"Total prices FIRM capacity for interconnection points","ENTRY REGULAR",{"$nulls":5},"ENTRY STORAGE",{"$nulls":5},"ENTRY LNG"]
[null,"Payable total prices FIRM capacity for domestic points"]
[null,null,"Year","Quarter","Month","Day","Within-day",null,"Year","Quarter","Month","Day","Within-day",null,"Year","Quarter","Month","Day","Within-day"]
[null,null,"EUR/kWh/h/Y","EUR/kWh/h/Q","EUR/kWh/h/M","EUR/kWh/h/DA","EUR/kWh/h/WID",null,"EUR/kWh/h/Y","EUR/kWh/h/Q","EUR/kWh/h/M","EUR/kWh/h/DA","EUR/kWh/h/WID",null,"EUR/kWh/h/Y","EUR/kWh/h/Q","EUR/kWh/h/M","EUR/kWh/h/DA","EUR/kWh/h/WID"]
[]
[null,"January",{"$f":"'Transmission tariffs'!C13+'Neutrality charge'!C13","v":5.76157135},{"$f":"'Transmission tariffs'!D13+'Neutrality charge'!D13","v":{"v":2.6317753,"d":"2.63177530"}},{"$f":"'Transmission tariffs'!E13+'Neutrality charge'!E13","v":1.25882442},{"$f":"'Transmission tariffs'!F13+'Neutrality charge'!F13","v":0.04897731},{"$f":"'Transmission tariffs'!G13+'Neutrality charge'!G13","v":0.00204073},null,{"$f":"'Transmission tariffs'!I13+'Neutrality charge'!I13","v":1.44039284},{"$f":"'Transmission tariffs'!J13+'Neutrality charge'!J13","v":{"v":0.6579438200000001,"d":"0.65794382"}},{"$f":"'Transmission tariffs'!K13+'Neutrality charge'!K13","v":{"v":0.31470610000000004,"d":"0.31470610"}},{"$f":"'Transmission tariffs'!L13+'Neutrality charge'!L13","v":0.01224432},{"$f":"'Transmission tariffs'!M13+'Neutrality charge'!M13","v":0.00051019},null,{"$f":"'Transmission tariffs'!O13+'Neutrality charge'!O13","v":4.60925708},{"$f":"'Transmission tariffs'!P13+'Neutrality charge'!P13","v":2.10542023},{"$f":"'Transmission tariffs'!Q13+'Neutrality charge'!Q13","v":1.00705953},{"$f":"'Transmission tariffs'!R13+'Neutrality charge'!R13","v":0.03918184},{"$f":"'Transmission tariffs'!S13+'Neutrality charge'!S13","v":{"v":1.63258E-3,"d":"0.00163258"}}]
[null,"February",null,null,{"$f":"'Transmission tariffs'!E14+'Neutrality charge'!E14","v":1.01634119},{"$f":"'Transmission tariffs'!F14+'Neutrality charge'!F14","v":{"v":0.043784,"d":"0.04378400"}},{"$f":"'Transmission tariffs'!G14+'Neutrality charge'!G14","v":{"v":1.8243399999999998E-3,"d":"0.00182434"}},{"$nulls":3},{"$f":"'Transmission tariffs'!K14+'Neutrality charge'!K14","v":{"v":0.25408529999999996,"d":"0.25408530"}},{"$f":"'Transmission tariffs'!L14+'Neutrality charge'!L14","v":{"v":0.010946,"d":"0.01094600"}},{"$f":"'Transmission tariffs'!M14+'Neutrality charge'!M14","v":{"v":0.0004561,"d":"0.00045610"}},{"$nulls":3},{"$f":"'Transmission tariffs'!Q14+'Neutrality charge'!Q14","v":0.81307295},{"$f":"'Transmission tariffs'!R14+'Neutrality charge'!R14","v":0.03502719},{"$f":"'Transmission tariffs'!S14+'Neutrality charge'!S14","v":{"v":1.45948E-3,"d":"0.00145948"}}]
[null,"March",null,null,{"$f":"'Transmission tariffs'!E15+'Neutrality charge'!E15","v":0.88007607},{"$f":"'Transmission tariffs'!F15+'Neutrality charge'!F15","v":{"v":0.034226099999999995,"d":"0.03422610"}},{"$f":"'Transmission tariffs'!G15+'Neutrality charge'!G15","v":{"v":1.4261E-3,"d":"0.00142610"}},{"$nulls":3},{"$f":"'Transmission tariffs'!K15+'Neutrality charge'!K15","v":{"v":0.22001901999999998,"d":"0.22001902"}},{"$f":"'Transmission tariffs'!L15+'Neutrality charge'!L15","v":0.00855653},{"$f":"'Transmission tariffs'!M15+'Neutrality charge'!M15","v":0.00035653},{"$nulls":3},{"$f":"'Transmission tariffs'!Q15+'Neutrality charge'!Q15","v":0.70406086},{"$f":"'Transmission tariffs'!R15+'Neutrality charge'!R15","v":0.02738088},{"$f":"'Transmission tariffs'!S15+'Neutrality charge'!S15","v":0.00114088}]
[null,"April",null,{"$f":"'Transmission tariffs'!D16+'Neutrality charge'!D16","v":1.40771762},{"$f":"'Transmission tariffs'!E16+'Neutrality charge'!E16","v":0.63503566},{"$f":"'Transmission tariffs'!F16+'Neutrality charge'!F16","v":0.02552455},{"$f":"'Transmission tariffs'!G16+'Neutrality charge'!G16","v":{"v":1.06353E-3,"d":"0.00106353"}},null,null,{"$f":"'Transmission tariffs'!J16+'Neutrality charge'!J16","v":{"v":0.3519294,"d":"0.35192940"}},{"$f":"'Transmission tariffs'!K16+'Neutrality charge'!K16","v":0.15875892},{"$f":"'Transmission tariffs'!L16+'Neutrality charge'!L16","v":{"v":6.3811399999999996E-3,"d":"0.00638114"}},{"$f":"'Transmission tariffs'!M16+'Neutrality charge'!M16","v":0.00026589},null,null,{"$f":"'Transmission tariffs'!P16+'Neutrality charge'!P16","v":{"v":1.1261741,"d":"1.12617410"}},{"$f":"'Transmission tariffs'!Q16+'Neutrality charge'!Q16","v":{"v":0.5080285299999999,"d":"0.50802853"}},{"$f":"'Transmission tariffs'!R16+'Neutrality charge'!R16","v":0.02041964},{"$f":"'Transmission tariffs'!S16+'Neutrality charge'!S16","v":0.00085082}]
[null,"May",null,null,{"$f":"'Transmission tariffs'!E17+'Neutrality charge'!E17","v":{"v":0.5813346500000001,"d":"0.58133465"}},{"$f":"'Transmission tariffs'!F17+'Neutrality charge'!F17","v":0.02262403},{"$f":"'Transmission tariffs'!G17+'Neutrality charge'!G17","v":0.00094268},{"$nulls":3},{"$f":"'Transmission tariffs'!K17+'Neutrality charge'!K17","v":0.14533366},{"$f":"'Transmission tariffs'!L17+'Neutrality charge'!L17","v":0.00565601},{"$f":"'Transmission tariffs'!M17+'Neutrality charge'!M17","v":{"v":2.3567E-4,"d":"0.00023567"}},{"$nulls":3},{"$f":"'Transmission tariffs'!Q17+'Neutrality charge'!Q17","v":0.46506773},{"$f":"'Transmission tariffs'!R17+'Neutrality charge'!R17","v":0.01809922},{"$f":"'Transmission tariffs'!S17+'Neutrality charge'!S17","v":0.00075415}]
[null,"June",null,null,{"$f":"'Transmission tariffs'!E18+'Neutrality charge'!E18","v":0.47236992},{"$f":"'Transmission tariffs'!F18+'Neutrality charge'!F18","v":{"v":0.019005300000000003,"d":"0.01900530"}},{"$f":"'Transmission tariffs'!G18+'Neutrality charge'!G18","v":{"v":7.919E-4,"d":"0.00079190"}},{"$nulls":3},{"$f":"'Transmission tariffs'!K18+'Neutrality charge'!K18","v":0.11809249},{"$f":"'Transmission tariffs'!L18+'Neutrality charge'!L18","v":{"v":0.004751320000000001,"d":"0.00475132"}},{"$f":"'Transmission tariffs'!M18+'Neutrality charge'!M18","v":{"v":1.9798E-4,"d":"0.00019798"}},{"$nulls":3},{"$f":"'Transmission tariffs'!Q18+'Neutrality charge'!Q18","v":0.37789594},{"$f":"'Transmission tariffs'!R18+'Neutrality charge'!R18","v":0.01520423},{"$f":"'Transmission tariffs'!S18+'Neutrality charge'!S18","v":0.00063352}]
[null,"July",null,{"$f":"'Transmission tariffs'!D19+'Neutrality charge'!D19","v":1.14181716},{"$f":"'Transmission tariffs'!E19+'Neutrality charge'!E19","v":0.46095728},{"$f":"'Transmission tariffs'!F19+'Neutrality charge'!F19","v":0.01792795},{"$f":"'Transmission tariffs'!G19+'Neutrality charge'!G19","v":{"v":7.470100000000001E-4,"d":"0.00074701"}},null,null,{"$f":"'Transmission tariffs'!J19+'Neutrality charge'!J19","v":0.28545429},{"$f":"'Transmission tariffs'!K19+'Neutrality charge'!K19","v":{"v":0.11523931999999999,"d":"0.11523932"}},{"$f":"'Transmission tariffs'!L19+'Neutrality charge'!L19","v":0.00448199},{"$f":"'Transmission tariffs'!M19+'Neutrality charge'!M19","v":{"v":1.8675999999999998E-4,"d":"0.00018676"}},null,null,{"$f":"'Transmission tariffs'!P19+'Neutrality charge'!P19","v":{"v":0.9134537300000001,"d":"0.91345373"}},{"$f":"'Transmission tariffs'!Q19+'Neutrality charge'!Q19","v":{"v":0.36876581999999997,"d":"0.36876582"}},{"$f":"'Transmission tariffs'!R19+'Neutrality charge'!R19","v":0.01434237},{"$f":"'Transmission tariffs'!S19+'Neutrality charge'!S19","v":{"v":5.9761000000000015E-4,"d":"0.00059761"}}]
[null,"August",null,null,{"$f":"'Transmission tariffs'!E20+'Neutrality charge'!E20","v":0.43820302},{"$f":"'Transmission tariffs'!F20+'Neutrality charge'!F20","v":0.01707161},{"$f":"'Transmission tariffs'!G20+'Neutrality charge'!G20","v":0.00071133},{"$nulls":3},{"$f":"'Transmission tariffs'!K20+'Neutrality charge'!K20","v":0.10955075},{"$f":"'Transmission tariffs'!L20+'Neutrality charge'!L20","v":0.00426791},{"$f":"'Transmission tariffs'!M20+'Neutrality charge'!M20","v":0.00017784},{"$nulls":3},{"$f":"'Transmission tariffs'!Q20+'Neutrality charge'!Q20","v":0.35056242},{"$f":"'Transmission tariffs'!R20+'Neutrality charge'!R20","v":0.01365729},{"$f":"'Transmission tariffs'!S20+'Neutrality charge'!S20","v":{"v":5.6907000000000008E-4,"d":"0.00056907"}}]
{"$rows_left_out":23}
{"sheet":"Transmission tariffs","index":3,"n_rows":42,"n_cols":19,"rows_kept":42,"merged":[[7,2,7,6],[7,8,7,12],[7,14,7,18],[12,2,23,2],[12,3,14,3],[12,8,23,8],[12,9,14,9],[12,14,23,14],[12,15,14,15],[15,3,17,3],[15,9,17,9],[15,15,17,15],[18,3,20,3],[18,9,20,9],[18,15,20,15],[21,3,23,3],[21,9,23,9],[21,15,23,15],[25,2,25,6],[25,8,25,12],[30,2,41,2],[30,3,32,3],[30,8,41,8],[30,9,32,9],[33,3,35,3],[33,9,35,9],[36,3,38,3],[36,9,38,9],[39,3,41,3],[39,9,41,9]]}
[]
[]
[]
[null,"ALL-IN TRANSMISSION TARIFFS 2026 (as established by the Dutch regulator ACM)"]
[]
[null,"Tariffs are all rounded to 8 decimals. Within-day prices are rounded up. "]
[]
[null,"Reserve prices FIRM capacity for interconnection points","ENTRY REGULAR",{"$nulls":5},"ENTRY STORAGE",{"$nulls":5},"ENTRY LNG"]
[null,"Payable prices FIRM capacity for domestic points"]
[null,null,"Year","Quarter","Month","Day","Within-day",null,"Year","Quarter","Month","Day","Within-day",null,"Year","Quarter","Month","Day","Within-day"]
[null,null,"EUR/kWh/h/Y","EUR/kWh/h/Q","EUR/kWh/h/M","EUR/kWh/h/DA","EUR/kWh/h/WID",null,"EUR/kWh/h/Y","EUR/kWh/h/Q","EUR/kWh/h/M","EUR/kWh/h/DA","EUR/kWh/h/WID",null,"EUR/kWh/h/Y","EUR/kWh/h/Q","EUR/kWh/h/M","EUR/kWh/h/DA","EUR/kWh/h/WID"]
[]
[null,"Januari",5.71417681,2.61012638,1.24846936,0.04857442,0.00202394,null,{"v":1.4285442,"d":"1.42854420"},0.65253159,0.31211734,{"v":0.0121436,"d":"0.01214360"},{"v":5.0599E-4,"d":"0.00050599"},null,4.57134145,{"v":2.0881011,"d":"2.08810110"},0.99877548,0.03885953,{"v":1.61915E-3,"d":"0.00161915"}]
[null,"Februari",{"v":0,"d":"0.00000000"},{"v":0,"d":"0.00000000"},1.00798079,0.04342383,{"v":1.8093299999999998E-3,"d":"0.00180933"},null,{"v":0,"d":"0.00000000"},{"v":0,"d":"0.00000000"},{"v":0.2519952,"d":"0.25199520"},0.01085596,{"v":4.5233999999999997E-4,"d":"0.00045234"},null,{"v":0,"d":"0.00000000"},{"v":0,"d":"0.00000000"},0.80638463,0.03473906,{"v":1.44747E-3,"d":"0.00144747"}]
[null,"Maart",{"v":0,"d":"0.00000000"},{"v":0,"d":"0.00000000"},0.87283659,0.03394456,0.00141436,null,{"v":0,"d":"0.00000000"},{"v":0,"d":"0.00000000"},0.21820915,0.00848614,0.00035359,null,{"v":0,"d":"0.00000000"},{"v":0,"d":"0.00000000"},0.69826927,0.02715565,{"v":1.13149E-3,"d":"0.00113149"}]
[null,"April",{"v":0,"d":"0.00000000"},1.39613777,0.62981187,0.02531459,{"v":1.05478E-3,"d":"0.00105478"},null,{"v":0,"d":"0.00000000"},0.34903444,0.15745297,0.00632865,{"v":0.0002637,"d":"0.00026370"},null,{"v":0,"d":"0.00000000"},1.11691022,{"v":0.5038495,"d":"0.50384950"},0.02025167,0.00084382]
[null,"Mei",{"v":0,"d":"0.00000000"},{"v":0,"d":"0.00000000"},0.57655261,0.02243793,{"v":9.3492E-4,"d":"0.00093492"},null,{"v":0,"d":"0.00000000"},{"v":0,"d":"0.00000000"},0.14413815,{"v":5.60948E-3,"d":"0.00560948"},{"v":2.3373E-4,"d":"0.00023373"},null,{"v":0,"d":"0.00000000"},{"v":0,"d":"0.00000000"},0.46124209,0.01795034,{"v":7.4794E-4,"d":"0.00074794"}]
[null,"Juni",{"v":0,"d":"0.00000000"},{"v":0,"d":"0.00000000"},0.46848422,0.01884896,0.00078538,null,{"v":0,"d":"0.00000000"},{"v":0,"d":"0.00000000"},0.11712106,0.00471224,{"v":1.9635E-4,"d":"0.00019635"},null,{"v":0,"d":"0.00000000"},{"v":0,"d":"0.00000000"},0.37478738,0.01507916,{"v":0.0006283,"d":"0.00062830"}]
[null,"Juli",{"v":0,"d":"0.00000000"},{"v":1.1324246,"d":"1.13242460"},0.45716546,0.01778048,{"v":7.4086000000000009E-4,"d":"0.00074086"},null,{"v":0,"d":"0.00000000"},0.28310615,0.11429136,0.00444512,0.00018522,null,{"v":0,"d":"0.00000000"},0.90593968,0.36573236,0.01422439,{"v":5.926900000000001E-4,"d":"0.00059269"}]
[null,"Augustus",{"v":0,"d":"0.00000000"},{"v":0,"d":"0.00000000"},0.43459837,0.01693118,0.00070547,null,{"v":0,"d":"0.00000000"},{"v":0,"d":"0.00000000"},0.10864959,{"v":0.0042328,"d":"0.00423280"},0.00017637,null,{"v":0,"d":"0.00000000"},{"v":0,"d":"0.00000000"},{"v":0.3476787,"d":"0.34767870"},0.01354495,{"v":5.6438000000000007E-4,"d":"0.00056438"}]
{"$rows_left_out":23}
{"sheet":"Neutrality charge","index":4,"n_rows":42,"n_cols":19,"rows_kept":42,"merged":[[7,2,7,6],[7,8,7,12],[7,14,7,18],[12,2,23,2],[12,3,14,3],[12,8,23,8],[12,9,14,9],[12,14,23,14],[12,15,14,15],[15,3,17,3],[15,9,17,9],[15,15,17,15],[18,3,20,3],[18,9,20,9],[18,15,20,15],[21,3,23,3],[21,9,23,9],[21,15,23,15],[25,2,25,6],[25,8,25,12],[30,2,41,2],[30,3,32,3],[30,8,41,8],[30,9,32,9],[33,3,35,3],[33,9,35,9],[36,3,38,3],[36,9,38,9],[39,3,41,3],[39,9,41,9]]}
[]
[]
[]
[null,"NEUTRALITY CHARGE 2026 (as established by GTS in accordance with calculation methodology as stated in the Transmission Code Gas - TSO)"]
[]
[null,"Charges are all rounded to 8 decimals. Within-day prices are rounded up. "]
[]
[null,"Charge FIRM capacity for interconnection points","ENTRY REGULAR",{"$nulls":5},"ENTRY STORAGE",{"$nulls":5},"ENTRY LNG"]
[null,"Payable charge FIRM capacity for domestic points"]
[null,null,"Year","Quarter","Month","Day","Within-day",null,"Year","Quarter","Month","Day","Within-day",null,"Year","Quarter","Month","Day","Within-day"]
[null,null,"EUR/kWh/h/Y","EUR/kWh/h/Q","EUR/kWh/h/M","EUR/kWh/h/DA","EUR/kWh/h/WID",null,"EUR/kWh/h/Y","EUR/kWh/h/Q","EUR/kWh/h/M","EUR/kWh/h/DA","EUR/kWh/h/WID",null,"EUR/kWh/h/Y","EUR/kWh/h/Q","EUR/kWh/h/M","EUR/kWh/h/DA","EUR/kWh/h/WID"]
[]
[null,"Januari",0.04739454,0.02164892,0.01035506,0.00040289,{"v":1.679E-5,"d":"0.00001679"},null,0.01184864,0.00541223,0.00258876,{"v":1.0072E-4,"d":"0.00010072"},{"v":4.2e-06,"d":"0.00000420"},null,0.03791563,0.01731913,0.00828405,0.00032231,{"v":1.343E-5,"d":"0.00001343"}]
[null,"Februari",null,null,{"v":0.0083604,"d":"0.00836040"},0.00036017,{"v":1.501E-5,"d":"0.00001501"},{"$nulls":3},{"v":0.0020901,"d":"0.00209010"},{"v":9.004e-05,"d":"0.00009004"},{"v":3.76E-6,"d":"0.00000376"},{"$nulls":3},0.00668832,0.00028813,{"v":1.201E-5,"d":"0.00001201"}]
[null,"Maart",null,null,0.00723948,0.00028154,{"v":1.174e-05,"d":"0.00001174"},{"$nulls":3},0.00180987,{"v":7.039e-05,"d":"0.00007039"},{"v":2.94e-06,"d":"0.00000294"},{"$nulls":3},0.00579159,0.00022523,{"v":9.39e-06,"d":"0.00000939"}]
[null,"April",null,0.01157985,0.00522379,{"v":2.0996E-4,"d":"0.00020996"},{"v":8.75e-06,"d":"0.00000875"},null,null,0.00289496,0.00130595,{"v":5.249e-05,"d":"0.00005249"},{"v":2.1899999999999998E-6,"d":"0.00000219"},null,null,0.00926388,0.00417903,0.00016797,{"v":7e-06,"d":"0.00000700"}]
[null,"Mei",null,null,0.00478204,{"v":1.861E-4,"d":"0.00018610"},{"v":7.76e-06,"d":"0.00000776"},{"$nulls":3},0.00119551,{"v":4.653e-05,"d":"0.00004653"},{"v":1.94e-06,"d":"0.00000194"},{"$nulls":3},0.00382564,{"v":1.4888E-4,"d":"0.00014888"},{"v":6.21e-06,"d":"0.00000621"}]
[null,"Juni",null,null,{"v":0.0038857,"d":"0.00388570"},0.00015634,{"v":6.52e-06,"d":"0.00000652"},{"$nulls":3},0.00097143,{"v":3.908e-05,"d":"0.00003908"},{"v":1.6299999999999999E-6,"d":"0.00000163"},{"$nulls":3},0.00310856,0.00012507,{"v":5.22E-6,"d":"0.00000522"}]
[null,"Juli",null,0.00939256,{"v":3.79182E-3,"d":"0.00379182"},{"v":1.4747E-4,"d":"0.00014747"},{"v":6.1499999999999996E-6,"d":"0.00000615"},null,null,0.00234814,0.00094796,{"v":3.687e-05,"d":"0.00003687"},{"v":1.5399999999999999E-6,"d":"0.00000154"},null,null,0.00751405,{"v":3.03346E-3,"d":"0.00303346"},0.00011798,{"v":4.92e-06,"d":"0.00000492"}]
[null,"Augustus",null,null,{"v":3.60465E-3,"d":"0.00360465"},0.00014043,{"v":5.86e-06,"d":"0.00000586"},{"$nulls":3},0.00090116,{"v":3.511e-05,"d":"0.00003511"},{"v":1.47e-06,"d":"0.00000147"},{"$nulls":3},0.00288372,{"v":1.1234E-4,"d":"0.00011234"},{"v":4.69E-6,"d":"0.00000469"}]
{"$rows_left_out":23}
{"sheet":"Optimalisation","index":5,"n_rows":83,"n_cols":28,"rows_kept":83,"hidden":true,"merged":[[24,24,24,27],[25,15,25,16],[25,17,25,18],[25,19,25,21],[25,22,25,23],[56,5,56,8],[56,10,56,13]]}
[]
[]
[]
[null,"COLLECTING DATA FOR OPTIMALISATION"]
[]
[null,"Helping cell: row number","Numbers of months applicable","Month number","Final \nmonth","Year","Month \nname","Helping cell: \ncode Y&M","Days per month in desired period"]
[{"$nulls":11},"date","year","quarter","month","day"]
[null,0,null,{"$f":"O8","v":1},null,{"$f":"M8","v":2026},{"$f":"IF(D8=\"\",D8,INDEX(C$60:C$71,$D8,1))","v":"January"},{"$f":"CONCATENATE(F8,G8)","v":"2026January"},{"$f":"P19","v":31},null,"Start date",{"$f":"'Period booking'!D8","v":"2026-01-01"},{"$f":"YEAR(L8)","v":2026},"n.a.",{"$f":"MONTH(L8)","v":1},{"$f":"DAY(L8)","v":1}]
[null,{"$f":"B8+1","v":1},{"$f":"IF(B9>P$18,\"\",B9)","v":1},{"$f":"IF($C9=\"\",$C9,IF($D8+1=13,1,IF($D8+1>13,$D8+1-12,$D8+1)))","v":2},{"$f":"IF(AND(D10=\"\",D9<>\"\"),\"END\",\"\")","v":""},{"$f":"IF(D9=\"\",\"\",IF(AND($D9>$D8,$F8<$M$9),$M$8,$M$9))","v":2026},{"$f":"IF(D9=\"\",D9,INDEX(C$60:C$71,D9,1))","v":"February"},"2026February",{"$f":"IF($E9=\"END\",$P$9,IF($D9=\"\",\"\",VLOOKUP($H9,$D$60:$I$83,5,FALSE)))","v":28},null,"End date",{"$f":"'Period booking'!D9","v":"2026-12-31"},{"$f":"YEAR(L9)","v":2026},"n.a.",{"$f":"MONTH(L9)","v":12},{"$f":"DAY(L9)","v":31}]
[null,2,2,3,"",2026,"March","2026March",31]
[null,3,3,4,"",2026,"April","2026April",30,null,"Capacity",{"$nulls":3},"kWh/h",{"$f":"'Period booking'!D11","v":{"v":100000,"d":"100,000"}}]
[null,4,4,5,"",2026,"May","2026May",31,null,"Applicable yearly reserve price",{"$nulls":3},"EUR/kWh/h/y",{"$f":"K60","v":{"v":4.94149823,"d":"4.9415"}}]
[null,5,5,6,"",2026,"June","2026June",30,null,"Payable amount in case of yearly (flat) booking",{"$nulls":3},"EUR/y",{"$f":"P11*P12","v":{"v":494149.823,"d":"494,150"}}]
[null,6,6,7,"",2026,"July","2026July",31,null,"Payable amount after optimalisation",{"$nulls":3},"EUR/y",{"$f":"X53","v":{"v":494149.82299999986,"d":"494,150"}}]
[null,7,7,8,"",2026,"August","2026August",31,null,"Optimisation to yearly booking?",{"$nulls":4},{"$f":"IF(P13<P14,\"Yes\", \"No\")","v":"No"}]
[null,8,8,9,"",2026,"September","2026September",30]
[null,9,9,10,"",2026,"October","2026October",31,null,"Check same month:",{"$nulls":4},{"$f":"IF(AND(M8=M9,O8=O9),\"ZELFDEMAAND\",\"No\")","v":"No"}]
[null,10,10,11,"",2026,"November","2026November",30,null,"Number of months involved after starting month:",{"$nulls":4},{"$f":"IF(($O$9-$O$8)>0,($O$9-$O$8),IF(($O$9-$O$8)<0,IF($P$8=1,12+($O$9-$O$8),12+($O$9-$O$8)),IF($M$9=$M$8,0,13)))","v":11}]
[null,11,11,12,"END",2026,"December","2026December",31,null,"Number of days involved in starting month",{"$nulls":4},{"$f":"IF(P$17=\"ZELFDEMAAND\",$P$9-$P$8+1,_xlfn.DAYS(EOMONTH($L$8,0),$L$8)+1)","v":31}]
[null,12,"","","","","","",""]
{"$rows_left_out":64}
{"sheet":"Multipliers and SF","index":6,"n_rows":31,"n_cols":6,"rows_kept":31,"hidden":true}
[]
[]
[]
[null,"MULTIPLIERS AND SEASONAL FACTORS"]
[]
[null,"Multipliers (M)"]
[]
[null,"Quarterly multiplier","M-Q",1.25]
[null,"Monthly multiplier","M-M",1.5]
[null,"Daily multiplier","M-DA",1.75]
[null,"Within-day multiplier","M-WID",1.75]
[]
[null,"Seasonal factors (SF)",null,"Month","Day","WID"]
[]
[null,"SF - Jan",null,1.715,1.773,1.773]
[null,"SF - Feb",null,1.533,1.585,1.585]
[null,"SF - March",null,1.199,1.239,1.239]
[null,"SF - April",null,0.894,0.924,0.924]
[null,"SF - May",null,0.792,0.819,0.819]
[null,"SF - June",null,0.665,0.688,0.688]
{"$rows_left_out":12}
{"sheet":"Validation","index":7,"n_rows":15,"n_cols":3,"rows_kept":15,"hidden":true}
[]
[]
[]
[null,"VALIDATION POSTAGE STAMP POINTS"]
[]
[null,null,"Entry Regular"]
[null,null,"Entry Storage"]
[null,null,"Entry LNG"]
[null,null,"Exit non-storage"]
[null,null,"Exit storage"]
[]
[null,"VALIDATION FEBRUARY IN LEAP YEAR"]
[]
[null,null,"Yes"]
[null,null,"No"]