{"text_format":"3","workbook":"xlsx","n_sheets":8,"sheets":["EXPLANATION","Period booking","Total prices","Transmission tariffs","Neutrality charge","Optimalisation","Multipliers and SF","Validation"],"not_rendered":{"images":9,"macros":1,"defined_names":4},"read":"whole","date_system":"1900"}

{"sheet":"EXPLANATION","index":0,"n_rows":66,"n_cols":5,"rows_kept":66,"merged":[[16,1,16,2],[17,1,17,2],[18,1,18,2],[19,1,19,2],[20,1,20,2],[25,1,27,10],[29,1,32,10],[34,2,36,10],[38,2,40,10],[42,2,44,10],[48,2,48,10],[50,2,51,10],[53,2,54,10],[56,2,58,10],[61,1,62,10],[65,1,67,10]]}
[]
[]
[]
[null,"DISCLAIMER"]
[]
[null,"- GTS only provide's this file as service, no rights whatsoever may be derived from these calculations, shipper' bookings and GTS Invoices are leading."]
[null,"- Tariffs used in the calculation are the total prices for 2024 "]
[null,"- Total price is the sum of the all-in transmission tariff and the neutrality charge, whereby:"]
[null,"- transmission tariffs for 2024 are established by the Dutch regulator ACM (25 May 2023)"]
[null,"- neutrality charges for 2024 are established by GTS in accordance with the calculation methodology as stated in de Transmission Code Gas TSO"]
[null,null,"https://www.gasunietransportservices.nl/en/news/tariffs-decision-2024"]
[null,"- Multipliers and seasonal factors used as establish by the Duth regulator ACM in the NC TAR decision (11 December 2018):"]
[null,null,"https://www.gasunietransportservices.nl/en/news/acm-takes-a-final-decision-on-the-tariff-structure-of-gts"]
[]
[null,"LEGEND"]
[]
[null,"GREEN",null,null,"Input cells to be filled out by user"]
[null,"BLUE",null,null,"Fixed input data"]
[null,"YELLOW",null,null,"Calculated value "]
[null,"ORANGE",null,null,"Calculated resulting value"]
{"$rows_left_out":47}
{"sheet":"Period booking","index":1,"n_rows":42,"n_cols":8,"rows_kept":42,"merged":[[3,1,4,10],[12,1,12,7],[17,13,17,14]]}
[]
[]
[]
[null,"CALCULATION TOOL FOR OPTIMISATION OF PERIOD BOOKINGS INTO (Y, Q, M, DA) FIRM CAPACITY PRODUCTS"]
[]
[null,"Please fill in the appropriate values in the GREEN fields and find the optimalisation results below"]
[]
[null,"Start date",{"$f":"IF(OR(ISERROR(DAY($D$8)),ISERROR(DAY($D$9))),1,IF(OR($D$9<$D$8,$D$9>$D$8+366,$D$11<0),1,0))","v":0},"2024-01-01",{"$f":"IF(OR(ISERROR(DAY($D$8)),ISERROR(DAY($D$9))),\"WARNING: calculation not reliable due to incorrect start or end date; please correct!\",IF(D9<D8,\"WARNING: calculation not reliable due to incorrect start and end date (start date NOT before end date); please correct!\",IF(D9>D8+366,\" WARNING: calculation not reliable due to incorrect start and end date (period > 1 year), please correct!\",\"\")))","v":""}]
[null,"End date (including)",null,"2024-12-31",{"$f":"IF(Optimalisation!$T$53=11,\"REMARK: for this period a yearly booking is cheaper; please add 12th month to period for monthly cost estimate!\",IF(Optimalisation!$T$53=10,\"REMARK: for this period a yearly booking is cheaper; please add 11th and 12th month to period for monthly cost estimate!\",IF(Optimalisation!$T$53=9,\"REMARK: for this period a yearly booking is cheaper; please add 10th, 11th and 12th month to period for monthly cost estimate!\",\"\")))","v":""}]
[null,"Postage stamp point",null,"Entry non-SSO","For all dates/periods, the prices used in the calculation tool are the total prices 2024 (see sheet 'Explanation')"]
[null,"Quantity ","kWh/h",100,{"$f":"IF(D11<0,\"WARNING: quantity is negative, please correct to positive value!\",\"\")","v":""}]
[]
[null,"PERIOD BOOKING CONVERTED INTO OPTIMISED COMBINATION OF Y, Q, M, DA CAPACITY PRODUCTS"]
[]
[null,"Month","Year","Yearly capacity booking","Quarterly capacity booking","Monthly capacity booking","Daily capacity \nbooking","Cost/month\nbased on 2024 tariffs"]
[{"$nulls":3},"kWh/h","kWh/h","kWh/h","kWh/h","EUR"]
[]
[{"$nulls":6},"Total cost:",{"$f":"SUM(H19:H42)","v":{"v":223.80920799999996,"d":"€ 224"}}]
[null,"January",{"$f":"IF($C$8=1,\"\",YEAR(D$8))","v":2024},{"$f":"IF($C$8=1,\"\",Optimalisation!Y29)","v":"Y"},{"$f":"IF($C$8=1,\"\",Optimalisation!Z29)","v":""},{"$f":"IF($C$8=1,\"\",Optimalisation!AA29)","v":""},{"$f":"IF($C$8=1,\"\",Optimalisation!AB29)","v":""},{"$f":"IF($C$8=1,\"\",Optimalisation!X29)","v":{"v":18.956517617486337,"d":"€ 19"}}]
[null,"February",{"$f":"IF($C$8=1,\"\",YEAR(D$8))","v":2024},{"$f":"IF($C$8=1,\"\",Optimalisation!Y30)","v":"Y"},{"$f":"IF($C$8=1,\"\",Optimalisation!Z30)","v":""},{"$f":"IF($C$8=1,\"\",Optimalisation!AA30)","v":""},{"$f":"IF($C$8=1,\"\",Optimalisation!AB30)","v":""},{"$f":"IF($C$8=1,\"\",Optimalisation!X30)","v":{"v":17.733516480874314,"d":"€ 18"}}]
{"$rows_left_out":23}
{"sheet":"Total prices","index":2,"n_rows":42,"n_cols":13,"rows_kept":42,"merged":[[7,2,7,6],[7,8,7,12],[12,2,23,2],[12,3,14,3],[12,8,23,8],[12,9,14,9],[15,3,17,3],[15,9,17,9],[18,3,20,3],[18,9,20,9],[21,3,23,3],[21,9,23,9],[25,2,25,6],[25,8,25,12],[30,2,41,2],[30,3,32,3],[30,8,41,8],[30,9,32,9],[33,3,35,3],[33,9,35,9],[36,3,38,3],[36,9,38,9],[39,3,41,3],[39,9,41,9]]}
[]
[]
[]
[null,"TOTAL PRICES 2024 FIRM CAPACITY (which is sum of the all-in transmission tariffs and the neutrality charges)"]
[]
[]
[]
[null,"Total prices FIRM capacity for interconnection points","ENTRY NON-STORAGE",{"$nulls":5},"ENTRY STORAGE"]
[null,"Payable total prices FIRM capacity for domestic points"]
[null,null,"Year","Quarter","Month","Day","Within-day",null,"Year","Quarter","Month","Day","Within-day"]
[null,null,"EUR/kWh/h/Y","EUR/kWh/h/Q","EUR/kWh/h/M","EUR/kWh/h/DA","EUR/kWh/h/WID",null,"EUR/kWh/h/Y","EUR/kWh/h/Q","EUR/kWh/h/M","EUR/kWh/h/DA","EUR/kWh/h/WID"]
[]
[null,"January",{"$f":"'Transmission tariffs'!C13+'Neutrality charge'!C13","v":2.23809208},{"$f":"'Transmission tariffs'!D13+'Neutrality charge'!D13","v":1.08023869},{"$f":"'Transmission tariffs'!E13+'Neutrality charge'!E13","v":0.50756076},{"$f":"'Transmission tariffs'!F13+'Neutrality charge'!F13","v":0.02008627},{"$f":"'Transmission tariffs'!G13+'Neutrality charge'!G13","v":0.00083693},null,{"$f":"'Transmission tariffs'!I13+'Neutrality charge'!I13","v":0.89523684},{"$f":"'Transmission tariffs'!J13+'Neutrality charge'!J13","v":0.43209548},{"$f":"'Transmission tariffs'!K13+'Neutrality charge'!K13","v":{"v":0.20302430000000002,"d":"0.20302430"}},{"$f":"'Transmission tariffs'!L13+'Neutrality charge'!L13","v":0.00803451},{"$f":"'Transmission tariffs'!M13+'Neutrality charge'!M13","v":{"v":3.3476999999999997E-4,"d":"0.00033477"}}]
[null,"February",null,null,{"$f":"'Transmission tariffs'!E14+'Neutrality charge'!E14","v":0.44342658},{"$f":"'Transmission tariffs'!F14+'Neutrality charge'!F14","v":0.01875931},{"$f":"'Transmission tariffs'!G14+'Neutrality charge'!G14","v":{"v":7.8164E-4,"d":"0.00078164"}},{"$nulls":3},{"$f":"'Transmission tariffs'!K14+'Neutrality charge'!K14","v":0.17737063},{"$f":"'Transmission tariffs'!L14+'Neutrality charge'!L14","v":0.00750372},{"$f":"'Transmission tariffs'!M14+'Neutrality charge'!M14","v":{"v":3.1266000000000003E-4,"d":"0.00031266"}}]
[null,"March",null,null,{"$f":"'Transmission tariffs'!E15+'Neutrality charge'!E15","v":0.34320775},{"$f":"'Transmission tariffs'!F15+'Neutrality charge'!F15","v":{"v":0.013579889999999999,"d":"0.01357989"}},{"$f":"'Transmission tariffs'!G15+'Neutrality charge'!G15","v":{"v":5.6583000000000013E-4,"d":"0.00056583"}},{"$nulls":3},{"$f":"'Transmission tariffs'!K15+'Neutrality charge'!K15","v":{"v":0.13728310000000002,"d":"0.13728310"}},{"$f":"'Transmission tariffs'!L15+'Neutrality charge'!L15","v":{"v":5.4319600000000004E-3,"d":"0.00543196"}},{"$f":"'Transmission tariffs'!M15+'Neutrality charge'!M15","v":{"v":2.2632999999999998E-4,"d":"0.00022633"}}]
[null,"April",null,{"$f":"'Transmission tariffs'!D16+'Neutrality charge'!D16","v":{"v":0.49525431000000003,"d":"0.49525431"}},{"$f":"'Transmission tariffs'!E16+'Neutrality charge'!E16","v":{"v":0.23637555000000002,"d":"0.23637555"}},{"$f":"'Transmission tariffs'!F16+'Neutrality charge'!F16","v":{"v":9.66324E-3,"d":"0.00966324"}},{"$f":"'Transmission tariffs'!G16+'Neutrality charge'!G16","v":{"v":4.0262999999999996E-4,"d":"0.00040263"}},null,null,{"$f":"'Transmission tariffs'!J16+'Neutrality charge'!J16","v":{"v":0.19810171999999998,"d":"0.19810172"}},{"$f":"'Transmission tariffs'!K16+'Neutrality charge'!K16","v":0.09455022},{"$f":"'Transmission tariffs'!L16+'Neutrality charge'!L16","v":{"v":3.86529E-3,"d":"0.00386529"}},{"$f":"'Transmission tariffs'!M16+'Neutrality charge'!M16","v":0.00016106}]
[null,"May",null,null,{"$f":"'Transmission tariffs'!E17+'Neutrality charge'!E17","v":0.19221909},{"$f":"'Transmission tariffs'!F17+'Neutrality charge'!F17","v":{"v":0.007608589999999999,"d":"0.00760859"}},{"$f":"'Transmission tariffs'!G17+'Neutrality charge'!G17","v":{"v":3.1702E-4,"d":"0.00031702"}},{"$nulls":3},{"$f":"'Transmission tariffs'!K17+'Neutrality charge'!K17","v":0.07688763},{"$f":"'Transmission tariffs'!L17+'Neutrality charge'!L17","v":0.00304344},{"$f":"'Transmission tariffs'!M17+'Neutrality charge'!M17","v":{"v":1.2681000000000001E-4,"d":"0.00012681"}}]
[null,"June",null,null,{"$f":"'Transmission tariffs'!E18+'Neutrality charge'!E18","v":{"v":0.16510514999999998,"d":"0.16510515"}},{"$f":"'Transmission tariffs'!F18+'Neutrality charge'!F18","v":{"v":0.0067525,"d":"0.00675250"}},{"$f":"'Transmission tariffs'!G18+'Neutrality charge'!G18","v":{"v":2.8136000000000003E-4,"d":"0.00028136"}},{"$nulls":3},{"$f":"'Transmission tariffs'!K18+'Neutrality charge'!K18","v":0.06604206},{"$f":"'Transmission tariffs'!L18+'Neutrality charge'!L18","v":{"v":0.002701,"d":"0.00270100"}},{"$f":"'Transmission tariffs'!M18+'Neutrality charge'!M18","v":{"v":1.1253999999999999E-4,"d":"0.00011254"}}]
[null,"July",null,{"$f":"'Transmission tariffs'!D19+'Neutrality charge'!D19","v":0.38818056},{"$f":"'Transmission tariffs'!E19+'Neutrality charge'!E19","v":0.15781301},{"$f":"'Transmission tariffs'!F19+'Neutrality charge'!F19","v":0.00623883},{"$f":"'Transmission tariffs'!G19+'Neutrality charge'!G19","v":{"v":2.5995E-4,"d":"0.00025995"}},null,null,{"$f":"'Transmission tariffs'!J19+'Neutrality charge'!J19","v":0.15527222},{"$f":"'Transmission tariffs'!K19+'Neutrality charge'!K19","v":{"v":0.0631252,"d":"0.06312520"}},{"$f":"'Transmission tariffs'!L19+'Neutrality charge'!L19","v":{"v":2.4955299999999997E-3,"d":"0.00249553"}},{"$f":"'Transmission tariffs'!M19+'Neutrality charge'!M19","v":{"v":1.0397999999999999E-4,"d":"0.00010398"}}]
[null,"August",null,null,{"$f":"'Transmission tariffs'!E20+'Neutrality charge'!E20","v":0.15013562},{"$f":"'Transmission tariffs'!F20+'Neutrality charge'!F20","v":{"v":0.0059392,"d":"0.00593920"}},{"$f":"'Transmission tariffs'!G20+'Neutrality charge'!G20","v":0.00024747},{"$nulls":3},{"$f":"'Transmission tariffs'!K20+'Neutrality charge'!K20","v":{"v":0.060054249999999997,"d":"0.06005425"}},{"$f":"'Transmission tariffs'!L20+'Neutrality charge'!L20","v":0.00237568},{"$f":"'Transmission tariffs'!M20+'Neutrality charge'!M20","v":{"v":9.899e-05,"d":"0.00009899"}}]
{"$rows_left_out":23}
{"sheet":"Transmission tariffs","index":3,"n_rows":42,"n_cols":13,"rows_kept":42,"merged":[[7,2,7,6],[7,8,7,12],[12,2,23,2],[12,3,14,3],[12,8,23,8],[12,9,14,9],[15,3,17,3],[15,9,17,9],[18,3,20,3],[18,9,20,9],[21,3,23,3],[21,9,23,9],[25,2,25,6],[25,8,25,12],[30,2,41,2],[30,3,32,3],[30,8,41,8],[30,9,32,9],[33,3,35,3],[33,9,35,9],[36,3,38,3],[36,9,38,9],[39,3,41,3],[39,9,41,9]]}
[]
[]
[]
[null,"ALL-IN TRANSMISSION TARIFFS 2024 (as established by the Dutch regulator ACM)"]
[]
[null,"Tariffs are all rounded to 8 decimals. Within-day prices are rounded up. "]
[]
[null,"Reserve prices FIRM capacity for interconnection points","ENTRY NON-STORAGE",{"$nulls":5},"ENTRY STORAGE"]
[null,"Payable prices FIRM capacity for domestic points"]
[null,null,"Year","Quarter","Month","Day","Within-day",null,"Year","Quarter","Month","Day","Within-day"]
[null,null,"EUR/kWh/h/Y","EUR/kWh/h/Q","EUR/kWh/h/M","EUR/kWh/h/DA","EUR/kWh/h/WID",null,"EUR/kWh/h/Y","EUR/kWh/h/Q","EUR/kWh/h/M","EUR/kWh/h/DA","EUR/kWh/h/WID"]
[]
[null,"Januari",2.25405482,1.08794327,0.51118083,0.02022953,{"v":0.0008429,"d":"0.00084290"},null,0.90162193,0.43517731,0.20447233,0.00809181,0.00033716]
[null,"Februari",null,null,0.44658923,0.01889311,0.00078722,{"$nulls":3},0.17863569,0.00755724,0.00031489]
[null,"Maart",null,null,0.34565561,0.01367675,{"v":5.698700000000001E-4,"d":"0.00056987"},{"$nulls":3},0.13826224,{"v":0.0054707,"d":"0.00547070"},{"v":2.2794999999999998E-4,"d":"0.00022795"}]
[null,"April",null,0.49878661,0.23806145,0.00973216,0.00040551,null,null,0.19951464,0.09522458,0.00389286,0.00016221]
[null,"Mei",null,null,0.19359005,0.00766286,0.00031929,{"$nulls":3},0.07743602,{"v":3.06515E-3,"d":"0.00306515"},{"v":1.2772E-4,"d":"0.00012772"}]
[null,"Juni",null,null,0.16628273,{"v":6.80066E-3,"d":"0.00680066"},0.00028337,{"$nulls":3},0.06651309,{"v":2.72026E-3,"d":"0.00272026"},{"v":1.1334999999999999E-4,"d":"0.00011335"}]
[null,"Juli",null,0.39094918,0.15893858,0.00628333,0.00026181,null,null,0.15637967,0.06357543,0.00251333,{"v":1.0473E-4,"d":"0.00010473"}]
[null,"Augustus",null,null,0.15120643,0.00598156,0.00024924,{"$nulls":3},0.06048257,0.00239262,{"v":9.97e-05,"d":"0.00009970"}]
{"$rows_left_out":23}
{"sheet":"Neutrality charge","index":4,"n_rows":42,"n_cols":13,"rows_kept":42,"merged":[[7,2,7,6],[7,8,7,12],[12,2,23,2],[12,3,14,3],[12,8,23,8],[12,9,14,9],[15,3,17,3],[15,9,17,9],[18,3,20,3],[18,9,20,9],[21,3,23,3],[21,9,23,9],[25,2,25,6],[25,8,25,12],[30,2,41,2],[30,3,32,3],[30,8,41,8],[30,9,32,9],[33,3,35,3],[33,9,35,9],[36,3,38,3],[36,9,38,9],[39,3,41,3],[39,9,41,9]]}
[]
[]
[]
[null,"NEUTRALITY CHARGE 2024 (as established by GTS in accordance with calculation methodology as stated in the Transmission Code Gas - TSO)"]
[]
[null,"Charges are all rounded to 8 decimals. Within-day prices are rounded up. "]
[]
[null,"Charge FIRM capacity for interconnection points","ENTRY NON-STORAGE",{"$nulls":5},"ENTRY STORAGE"]
[null,"Payable charge FIRM capacity for domestic points"]
[null,null,"Year","Quarter","Month","Day","Within-day",null,"Year","Quarter","Month","Day","Within-day"]
[null,null,"EUR/kWh/h/Y","EUR/kWh/h/Q","EUR/kWh/h/M","EUR/kWh/h/DA","EUR/kWh/h/WID",null,"EUR/kWh/h/Y","EUR/kWh/h/Q","EUR/kWh/h/M","EUR/kWh/h/DA","EUR/kWh/h/WID"]
[]
[null,"Januari",-0.01596274,-0.00770458,{"v":-3.62007E-3,"d":"-0.00362007"},-0.00014326,{"v":-5.97e-06,"d":"-0.00000597"},null,-0.00638509,-0.00308183,-0.00144803,{"v":-5.73e-05,"d":"-0.00005730"},{"v":-2.39E-6,"d":"-0.00000239"}]
[null,"Februari",null,null,-0.00316265,{"v":-1.338E-4,"d":"-0.00013380"},{"v":-5.58e-06,"d":"-0.00000558"},{"$nulls":3},-0.00126506,{"v":-5.352e-05,"d":"-0.00005352"},{"v":-2.23e-06,"d":"-0.00000223"}]
[null,"Maart",null,null,-0.00244786,{"v":-9.686e-05,"d":"-0.00009686"},{"v":-4.04e-06,"d":"-0.00000404"},{"$nulls":3},-0.00097914,{"v":-3.874e-05,"d":"-0.00003874"},{"v":-1.62e-06,"d":"-0.00000162"}]
[null,"April",null,{"v":-0.0035323,"d":"-0.00353230"},{"v":-0.0016859,"d":"-0.00168590"},{"v":-6.892e-05,"d":"-0.00006892"},{"v":-2.88E-6,"d":"-0.00000288"},null,null,{"v":-1.41292E-3,"d":"-0.00141292"},-0.00067436,{"v":-2.757e-05,"d":"-0.00002757"},{"v":-1.15E-6,"d":"-0.00000115"}]
[null,"Mei",null,null,-0.00137096,{"v":-5.427E-5,"d":"-0.00005427"},{"v":-2.27e-06,"d":"-0.00000227"},{"$nulls":3},-0.00054839,{"v":-2.171e-05,"d":"-0.00002171"},{"v":-9.1e-07,"d":"-0.00000091"}]
[null,"Juni",null,null,-0.00117758,{"v":-4.816E-5,"d":"-0.00004816"},{"v":-2.01e-06,"d":"-0.00000201"},{"$nulls":3},-0.00047103,{"v":-1.926e-05,"d":"-0.00001926"},{"v":-8.1e-07,"d":"-0.00000081"}]
[null,"Juli",null,-0.00276862,{"v":-1.12557E-3,"d":"-0.00112557"},{"v":-4.45e-05,"d":"-0.00004450"},{"v":-1.86E-6,"d":"-0.00000186"},null,null,-0.00110745,-0.00045023,{"v":-1.78e-05,"d":"-0.00001780"},{"v":-7.5e-07,"d":"-0.00000075"}]
[null,"Augustus",null,null,-0.00107081,{"v":-4.236e-05,"d":"-0.00004236"},{"v":-1.77E-6,"d":"-0.00000177"},{"$nulls":3},-0.00042832,{"v":-1.694E-5,"d":"-0.00001694"},{"v":-7.1e-07,"d":"-0.00000071"}]
{"$rows_left_out":23}
{"sheet":"Optimalisation","index":5,"n_rows":83,"n_cols":28,"rows_kept":83,"hidden":true,"merged":[[24,24,24,27],[25,15,25,16],[25,17,25,18],[25,19,25,21],[25,22,25,23],[56,5,56,8],[56,10,56,13]]}
[]
[]
[]
[null,"COLLECTING DATA FOR OPTIMALISATION"]
[]
[null,"Helping cell: row number","Numbers of months applicable","Month number","Final \nmonth","Year","Month \nname","Helping cell: \ncode Y&M","Days per month in desired period"]
[{"$nulls":11},"date","year","quarter","month","day"]
[null,0,null,{"$f":"O8","v":1},null,{"$f":"M8","v":2024},{"$f":"IF(D8=\"\",D8,INDEX(C$60:C$71,$D8,1))","v":"January"},{"$f":"CONCATENATE(F8,G8)","v":"2024January"},{"$f":"P19","v":31},null,"Start date",{"$f":"'Period booking'!D8","v":"2024-01-01"},{"$f":"YEAR(L8)","v":2024},"n.a.",{"$f":"MONTH(L8)","v":1},{"$f":"DAY(L8)","v":1}]
[null,{"$f":"B8+1","v":1},{"$f":"IF(B9>P$18,\"\",B9)","v":1},{"$f":"IF($C9=\"\",$C9,IF($D8+1=13,1,IF($D8+1>13,$D8+1-12,$D8+1)))","v":2},{"$f":"IF(AND(D10=\"\",D9<>\"\"),\"END\",\"\")","v":""},{"$f":"IF(D9=\"\",\"\",IF(AND($D9>$D8,$F8<$M$9),$M$8,$M$9))","v":2024},{"$f":"IF(D9=\"\",D9,INDEX(C$60:C$71,D9,1))","v":"February"},"2024February",{"$f":"IF($E9=\"END\",$P$9,IF($D9=\"\",\"\",VLOOKUP($H9,$D$60:$I$83,5,FALSE)))","v":29},null,"End date",{"$f":"'Period booking'!D9","v":"2024-12-31"},{"$f":"YEAR(L9)","v":2024},"n.a.",{"$f":"MONTH(L9)","v":12},{"$f":"DAY(L9)","v":31}]
[null,2,2,3,"",2024,"March","2024March",31]
[null,3,3,4,"",2024,"April","2024April",30,null,"Capacity",{"$nulls":3},"kWh/h",{"$f":"'Period booking'!D11","v":100}]
[null,4,4,5,"",2024,"May","2024May",31,null,"Applicable yearly reserve price",{"$nulls":3},"EUR/kWh/h/y",{"$f":"K60","v":{"v":2.23809208,"d":"2.2381"}}]
[null,5,5,6,"",2024,"June","2024June",30,null,"Payable amount in case of yearly (flat) booking",{"$nulls":3},"EUR/y",{"$f":"P11*P12","v":{"v":223.80920799999998,"d":"224"}}]
[null,6,6,7,"",2024,"July","2024July",31,null,"Payable amount after optimalisation",{"$nulls":3},"EUR/y",{"$f":"X53","v":{"v":223.80920799999996,"d":"224"}}]
[null,7,7,8,"",2024,"August","2024August",31,null,"Optimisation to yearly booking?",{"$nulls":4},{"$f":"IF(P13<P14,\"Yes\", \"No\")","v":"No"}]
[null,8,8,9,"",2024,"September","2024September",30]
[null,9,9,10,"",2024,"October","2024October",31,null,"Check same month:",{"$nulls":4},{"$f":"IF(AND(M8=M9,O8=O9),\"ZELFDEMAAND\",\"No\")","v":"No"}]
[null,10,10,11,"",2024,"November","2024November",30,null,"Number of months involved after starting month:",{"$nulls":4},{"$f":"IF(($O$9-$O$8)>0,($O$9-$O$8),IF(($O$9-$O$8)<0,IF($P$8=1,12+($O$9-$O$8),12+($O$9-$O$8)),IF($M$9=$M$8,0,13)))","v":11}]
[null,11,11,12,"END",2024,"December","2024December",31,null,"Number of days involved in starting month",{"$nulls":4},{"$f":"IF(P$17=\"ZELFDEMAAND\",$P$9-$P$8+1,_xlfn.DAYS(EOMONTH($L$8,0),$L$8)+1)","v":31}]
[null,12,"","","","","","",""]
{"$rows_left_out":64}
{"sheet":"Multipliers and SF","index":6,"n_rows":31,"n_cols":6,"rows_kept":31,"hidden":true}
[]
[]
[]
[null,"MULTIPLIERS AND SEASONAL FACTORS"]
[]
[null,"Multipliers (M)"]
[]
[null,"Quarterly multiplier","M-Q",1.25]
[null,"Monthly multiplier","M-M",1.5]
[null,"Daily multiplier","M-DA",1.75]
[null,"Within-day multiplier","M-WID",1.75]
[]
[null,"Seasonal factors (SF)",null,"Month","Day","WID"]
[]
[null,"SF - Jan",null,1.785,1.877,1.877]
[null,"SF - Feb",null,1.667,1.753,1.753]
[null,"SF - March",null,1.207,1.269,1.269]
[null,"SF - April",null,0.859,0.903,0.903]
[null,"SF - May",null,0.676,0.711,0.711]
[null,"SF - June",null,{"v":0.6,"d":"0.600"},0.631,0.631]
{"$rows_left_out":12}
{"sheet":"Validation","index":7,"n_rows":14,"n_cols":3,"rows_kept":14,"hidden":true}
[]
[]
[]
[null,"VALIDATION POSTAGE STAMP POINTS"]
[]
[null,null,"Entry non-SSO"]
[null,null,"Entry SSO"]
[null,null,"Exit non-SSO"]
[null,null,"Exit SSO"]
[]
[null,"VALIDATION FEBRUARY IN LEAP YEAR"]
[]
[null,null,"Yes"]
[null,null,"No"]